You are not logged in. Click here to log in.

codebeamer Application Lifecycle Management (ALM)

Search In Project

Search inClear

Tags:  not added yet

codeBeamer 20.11-LTS (Carmen) - Licensing information
  • Every customer should renew their codeBeamer 20.11-LTS Licenses before upgrading, please contact with your Sales representative using sales@intland.com email address
codeBeamer 20.11-SP6 General Information
  • MariaDB is no longer supported please update to the officially supported MySQL version. If you used MariaDB driver for MySQL, please upgrade configuration.properties to MySQL
codeBeamer 20.11-SP4 General Information
  • Computed Table field should be addressed by computed formula using table field property index
codeBeamer 20.11-SP3 General Information
  • Member filtering on Report "Assigned To" selector will match only beginning of User name, for example: "John Doe" will match only if user enters "Jo" or "Do"
  • Mass Edit feature no longer supports Staff field types for editing
  • Please check Swagger API changes
codeBeamer 20.11-LTS (Carmen) - General information
  • The codename for 20.11 is Carmen -- for further information on release codenames please refer to codebeamer Release Codenames
  • codeBeamer 20.11 is an LTS (Long Time Support) version
  • Please note that Upgrading to Carmen version can take several hours. It is highly recommended to execute during Weekend
  • Oracle 12 is no longer supported please update to the officially supported Oracle 19 version
  • Internet Explorer 11 is no longer supported, please user Supported Browsers instead
  • PDF export was completely removed, please use Microsoft Word as PDF converter under Windows environment or using Linux environment users need to install an extra component
  • Microsoft Office support starting from Microsoft Office 2013, older versions are no longer supported
  • Derby Database is no longer supported
  • SSO signature logic has change you can read more about this feature: Generating Electronic Signature with SSO Login
  • Test steps can no longer be edited on Table and Document Edit views of Test case trackers -- however they still can be added to these views for viewing purposes
  • Read more about Swagger API changes within this version
  • Read more about Rest API changes within this version
  • Project Configuration Merge is no longer available
  • Tracker Locking is only available for Tracker Administrators
  • Traceability preset migration does not support selected multiple Trackers on Initial level
  • Test management now has built in support for formal test runs and as a result the test management workflow changed for new and existing test runs
    • In case you use custom project templates with test runs, please update them by executing the following migration script on them: Test Management workflow migration
    • Please also review the tracker, state transition and status field permissions of your Test Run tracker to make sure that they are as you expect them to be
    • Please note that field permissions are not fully supported by test management
    • By default, the custom fields will not appear in the standard test case and test run exports. Customers are to define their own templates as they see them fit
    • Importing custom test step fields from Excel is supported only in case of the following field types: Text, WikiText, Bool
      • Consequently, test step reuse is not recognized properly in case of unsupported field types
  • Restarting test runs are now possible without creating new test run(s) -- for more information about this optional feature, please see: re-running a test run without creating a new one
  • Test steps now support custom fields (both at test cases and test runs)
    • Consequently, the format of the Excel based test runs have changed
  • The attachment handling parameters of the Word exports have changed
    • If attachments are included in the export they are linked to the document by default
    • If embedding the attachments are enabled, all attachments are included into the document itself (as OLE objects)
    • If expanding the attachments are enabled, supported file types (images, text files, etc.) are displayed within the document
  • The trace direction of the Risk Management functionality has been reversed -- for more details, see: Risk Management trace direction change
  • Importing complex (choice, reference, wiki text) table field values has general known issues, which affects importing custom test step fields as well
  • Advanced document export functionality is now available for template developers -- see the related documentation at: Advanced document export functionality
    • Previously created templates continues to work, however there are slight functionality changes that affect the previous behavior as well -- for further details see the documentation of the new functionality
  • Diagram editor has been disabled for table fields (including test steps) due to compatibility issues
  • Item description editor mode is set to Markup by default. Please refer to this You must login to see this link. Register now, if you have no user account yet. on how to change that.
  • The codeBeamer API based on Hessian Protocol has been removed. It is recommended to use the Swagger API instead.


General Information about codeBeamer Service Packs

codeBeamer 20.11- Service Packs

Available Service Packs

codeBeamer 20.11-LTS - Release Notes

Bugs

  • BUG-2278804 - Already stored results of test run are overwritten in test set execution
  • BUG-403552 - Cannot restore tree state after creating new Directory
  • BUG-4515762 - Test management - Custom fields - If I reuse a step, the computed field is rewritten
  • BUG-4850984 - Excel import: integer/decimal/duration/etc other simple fields does not work when these are inside a table and has multi value (found in custom Step fields of Test Cases)
  • BUG-4853686 - Removing a column in document edit view when columns are resizable breaks saving changes
  • BUG-4857508 - Legacy Word Round Trip Export trows NPE exception when called by Anonymous Bot
  • BUG-4873516 - LDAP - Sync failed with proper configuration
  • BUG-4880336 - Reports - PostgreSQL - Order by Duration field with big numbers causes wrong order
  • BUG-4880555 - Tracker items - If there are multiple references in a table, then table displayed disintegrated in table view
  • BUG-4880565 - Tracker Views - On intelligent table view, custom field is mapped to a different tracker's custom field
  • BUG-4880962 - Intelligent Document/Table View exports empty initial levels items
  • BUG-4882237 - Risk Management - Default view mode is not updated
  • BUG-4882569 - Tracker View Widget - Business Value group by label is changed to Priority after load back a private view
  • BUG-4882578 - Wiki Page - More menu add comment "Save button" opens cancel dialog when Markup mode enabled
  • BUG-4882628 - Tracker Views - Panel view contains unversioned item summary under baseline
  • BUG-4882670 - Merge Request - Onscreen error with one special case in merge request
  • BUG-4883056 - User/Role selector overlay: can not properly select a Role if a user is already selected (for non-multi-user/role field)
  • BUG-4886161 - Conditions not considered when Workflow action opens an Editor
  • BUG-4886349 - Excel Export - Shared fields are not exported from Document Edit View
  • BUG-4886735 - Excel import mapping does not appear properly when the mapping text is long
  • BUG-4887057 - Excel Export - Cell that contains date has wrong cell format and it causes faulty appearance of the creation date
  • BUG-4887188 - Closing X icon is disappearing after failed Word/Excel export from Test Coverage view
  • BUG-4889764 - Tracker Views - Stored tracker views that contains Business Value group by, converts BV to Priority in the result
  • BUG-4889830 - Kanban Board - Load a saved tracker view that contains historical filter does not load items in versioned mode, and items are editable
  • BUG-4890440 - License - If invalid (old) license is set in application config and new in environment variable, the invalid is in use
  • BUG-4890697 - Reports - Removing Historical View filter does not count as change
  • BUG-4890699 - Tracker views - after switching to Traceability Browser if the query contains Has Associations To filter, it gives invalid cbQL
  • BUG-4891004 - Incorrect tracker type list in library filter
  • BUG-4891117 - Tracker Views - Show ancestor checkbox remains disabled when switching from ITV to a default table view
  • BUG-4891281 - Reports page - Sticky header disappeared if I open a parent item in a result list
  • BUG-4893355 - Reports - Summarize function does not work
  • BUG-4893393 - Planner - Refreshing page after group by field has changed causes invalid cbQL
  • BUG-4894145 - Slow item baselines loading
  • BUG-4894332 - Computing the Priority field using a formula does not work: max(subjects.{subject|subject.namedPriority})
  • BUG-4907935 - LDAP - Synced users appear in not active status
  • BUG-4911081 - Tracker View Widget - AND/OR Logic is empty or invalid.
  • BUG-4915322 - Trackers Tab and Dashboard export to Word does not work When Web socket is disabled
  • BUG-4916360 - Web socket notifications - If a Project Deployment process not successful the WS notification about the failure not appears on the current screen
  • BUG-4916427 - All reports included in a template project become unavailable
  • BUG-4916442 - History broken after update

Tasks

  • CTSK-4771208 - Keep only ID of the user in the 'usersCacheByName' cache
  • CTSK-4865313 - Measure CLOB read/write in stored procedure
  • CTSK-4865591 - Convert JS files to UTF-8 BOM on Windows
  • CTSK-4885862 - Measure network latency with a small SQL query
  • CTSK-4887018 - Show report generation started notification for user
  • CTSK-4915785 - Enable Websocket notification by default
  • CTSK-4915786 - Turn off "DB" wiki plugin by default

codeBeamer 20.11 (Carmen) - RC2 - Release Notes

Bugs

  • BUG-2776614 - Resizable columns feature won't work properly for Description field
  • BUG-3871070 - SCM - SVN checkout not working after a new role is added to the project
  • BUG-4432228 - Error during service desk upgrade
  • BUG-4534410 - Cannot modify member field in table view with resizable columns
  • BUG-4617082 - Reports - Historical View filter does not apply exporting a report to Excel
  • BUG-4749824 - Test Management - Test Cases with not allowed status is added to Test Set, when added from Test Case doc/doc edit view left panel
  • BUG-4749833 - Test Management - Test Case can be added to Test Set from Test Cases left tree, if it is not in allowed reference tracker
  • BUG-4764557 - User Interface - Icons are inconsistent with baselines
  • BUG-4771570 - Mandatory if - Add new/Edit row overlay - Mandatory if validations should appear on the overlay
  • BUG-4802324 - Intelligent Document View - Not matching item is not marked with pink in the tree when using a filter
  • BUG-4809325 - ReviewHub - There are no switch to head version button in the breadcrumb
  • BUG-4813231 - TrackerOutlineDao.getHistoryOutline(trackerId, history Timestamp) fails with timeout on custom database
  • BUG-4814883 - Test management - Image/ attachment upload problem into wiki text field in test runner
  • BUG-4833304 - Cross-tracker Associations Are not Imported during ReqIF import procedure
  • BUG-4840473 - Table Field Reference Column exported wrong format
  • BUG-4841092 - Mandatory if - When inline editing Table fields, mandatory if seems not triggered, although the condition is fulfilled.
  • BUG-4841384 - NPE during Escalation procedure
  • BUG-4841394 - PDF convert - failed to export pdf using Jacob
  • BUG-4841645 - Test Management - Content missing except first line in custom Wiki Text test step field, if bug is reported from test run
  • BUG-4841807 - Word export of test set coverage page fails
  • BUG-4843665 - ReqIF Import Silently Ignores Items in Trash
  • BUG-4845163 - Bug for "Copying items from the right panel(library) to the left tree and subtree" - DnD folder from library to tree item is possible
  • BUG-4848625 - Word Export - NPE on Release Coverage browser
  • BUG-4848743 - Reused test steps are not saved
  • BUG-4850917 - Commenting at item edit creates links to attachments
  • BUG-4850979 - Swagger API - Can't get table field values when a column is deleted
  • BUG-4851084 - Intelligent Document View on BMW performance test is slow
  • BUG-4851325 - Coverage Browser pages are slow on BMW performance test
  • BUG-4851371 - Test Coverage pages are slow in BMW performance tests
  • BUG-4853666 - System error when setting statuses at Review Hub finish
  • BUG-4853685 - Adding custom wiki link column in document edit view causes errors in the console when columns are resizable
  • BUG-4858019 - Merge Request - After applying changes on Mass Suspected Diff page, it loads the tracker page, instead of diff page reload
  • BUG-4858205 - Tracker Items - Adding the very same item with same association type should trigger error message
  • BUG-4858209 - Project Template - The trackers order changed when using Agile-Scrum smart template
  • BUG-4858885 - Shared report throws Lock Wait Timeout Exception during clean up procedure
  • BUG-4858919 - NPE during office Import in a specific case
  • BUG-4859085 - Filters change after sharing a table view
  • BUG-4859101 - Tracker items - Unnecessary window is opened when item is copied/moved
  • BUG-4863145 - Mandatory if - Jira/Doors sync - If I add new custom fields to a synchronized project (either Jira or doors), i can edit and setup mandatory if formulas without error.
  • BUG-4864313 - Filter does not apply in case of exporting a baselined tracker to Office
  • BUG-4864326 - Traceability Browser - Different items are visible on Work Item Traceability than Traceability Browser
  • BUG-4864525 - Traceability Browser - Links on Traceability Browser in Baseline mode navigates out of Baseline mode
  • BUG-4864528 - Reference View Settings - Maximum Reference Items tooltip message is wrong/changed, limit number displayed is not the set limit
  • BUG-4865422 - Table fields - Wiki links, Choice with single select field values are not visible after adding a new row.
  • BUG-4865531 - Excel import: the auto-assign of fields does not work if the field names are long: for example when inside tables
  • BUG-4865637 - Exception happens when system admin wants to regenerate SCM accesses
  • BUG-4865695 - Tracker Items - Items can be pasted and deleted while the tracker is locked by other user
  • BUG-4867456 - Request to Update Specific Field Clears Other Fields
  • BUG-4867464 - Permanent link - Traceability history view settings are not stored when 'refreshing' browser
  • BUG-4869687 - Web Socket uses thread per browser tabs instead if thread per user
  • BUG-4870301 - Table View pixel resizable columns width is broken on view save or after new column added or removed
  • BUG-4870435 - Review Hub - Status change performed by Review Hub executes workflow action only when "Execute valid state transition" checkbox is checked
  • BUG-4873041 - Review HUB - Scrolling on the center pane cause Uncaught ReferenceError: trackerObject is not defined console error
  • BUG-994121 - Project Browser - Working sets - creation of working sets with same name is possible, which leads to strange behaviour of affected working sets

Tasks

  • CTSK-4351020 - Intelligent Document View versioned nodes child items should represent the correct state of the versioned node
  • CTSK-4864632 - Show the loading animation when executing quick transitions

codeBeamer 20.11 (Carmen) - RC1 - Release Notes

Bugs

  • BUG-1021488 - The project Icon is not set properly in the Working Set
  • BUG-1552949 - Unstar does not work in My Starred Items
  • BUG-1758344 - Hidden widget header covers some part of the widget when appears
  • BUG-1954281 - Validation exception for testCasesByLastRunResult Widget when ReleaseId is null
  • BUG-1986945 - Latex Plugin failed in some cases
  • BUG-1990832 - TestSet's editor's TestPlan shows all TestCases even if they are not allowed by the Tracker configuration of the TestSet
  • BUG-2103227 - Cannot set omit suspected for Comments/Attachments field
  • BUG-2164415 - Restored items not exported in case of Baseline Word Export
  • BUG-2666407 - RPE Integration - NullPointerException logged when trying to access a report by its URL without permission
  • BUG-2696157 - Release related dates are not set correctly
  • BUG-2769553 - GANTT Chart - UI crashes if schedule an unplanned Sprint
  • BUG-2975259 - RPE Integration - Report and template fields do not work with URLs
  • BUG-2996428 - PDF export cannot handle Korean characters
  • BUG-3060877 - Incorrect multi level coverage results
  • BUG-3290741 - Document Export - Unable to export attachments from Test Runs
  • BUG-3354839 - Tracker configuration - decimal fields display up to 2 decimal digits and no more - this causes empty result in reports, search, filtering, etc.
  • BUG-3361760 - Tracker description is exported as its Markup style in the exported Word document
  • BUG-3402415 - Kanban Board configuration - Rendering of Transitions is inconsistent
  • BUG-3575933 - Data loss when using the in-place edit in Document View
  • BUG-3583096 - Can't clear priority when updating individual fields with Swagger API
  • BUG-3633378 - Removed custom field is duplicated when restoring from project template
  • BUG-3726537 - Traceability Browser - If I switch from another view with group by filters to Traceability, error appears
  • BUG-3744453 - When copying test case with reused test steps, test step reuse link is broken in copy
  • BUG-3746834 - Improper date parsed/displayed when adding Reminder for tracker item
  • BUG-3799341 - Incorrect user logged in audit trail
  • BUG-3829475 - Buggy Mass Edit view
  • BUG-3854553 - Excel sheet filter field is missing in test case - test parameters part
  • BUG-3869625 - Items disappear from trash by clicking paging buttons
  • BUG-3921439 - In Document view, the "Switch to Referring item" is not working, the created item is not opened
  • BUG-3940876 - Reference field dependency is not functional in Mass edit
  • BUG-3949587 - Merge Request - if an empty value is merged to a mandatory field, error is displayed
  • BUG-3956855 - Right side panel doesn't refresh References tab
  • BUG-3957624 - Selected (and all) text is not added to the new Work item's description when Markup Mode is selected
  • BUG-4010009 - Reviewer's link redirects to Reviewer's personal WIKI page instead of user account page
  • BUG-4012398 - Intelligent Document View current head versioned rows are not read only in centre pane
  • BUG-4017553 - Planner - using Infinite scroll delete the multiple selection when I use mulitple selection
  • BUG-4046004 - In case of using German language, some of the texts appear in English in Test Run creation
  • BUG-4057926 - Auto completion for Assigned to of indirect project members is gone
  • BUG-4086088 - Multiple permanent project removing causes deadlock, only one project can be deleted at the same time
  • BUG-4105791 - Can not create Work log from Timetracker because invalid references.
  • BUG-4152662 - Comment context menu could contain Download and Direct URL options in baseline mode in Item details page
  • BUG-4152966 - After switching off inheritance, reference to template project retained in custom Guards, Conditions and Reference filters in exported JSON
  • BUG-4221870 - On Traceability Browser the default tracker is not good, after I opened it from a Branch.
  • BUG-4226998 - Incorrect choice field value appears while editing other fields
  • BUG-4227540 - User with read permission cannot able to download multiple documents
  • BUG-4229993 - Tracker Views - Historical Filter and other filters are loaded in tracker view if filters were used in Baseline Diff page before
  • BUG-4239154 - Review Hub - Restart Review - new items added to the review appear in random places in the tree
  • BUG-4250040 - There are no checkboxes to add wikis/dashboards in associations dialog
  • BUG-4269636 - Static field dependency issue in inline edit mode
  • BUG-4275776 - Possible data loss in Document view when leave message appears with open editor
  • BUG-4275960 - In Requirements trackers (except System Requirement Specifications) I can add items multiple times in case of new choice fields
  • BUG-4276648 - Item locks in case of table view do not work.
  • BUG-4277795 - Upgraded packery-mode.pkgd.js library using MIT license
  • BUG-4277821 - Messed up entries in Recently Visited Items
  • BUG-4297898 - Section Review disabled in wiki text overlay mode
  • BUG-4301097 - Refreshing Traceability preset causes js console error
  • BUG-4301376 - Concurrent execution of sequential test run causes error
  • BUG-4321365 - ReqIF Export Generating Invalid Content
  • BUG-4321517 - [XSS] Reference fields
  • BUG-4322316 - Mention does not working properly on a first try
  • BUG-4322601 - Swagger API call updateCustomFieldTrackerItem() allows setting field to value of wrong type
  • BUG-4324728 - Missing German translation at Project Deployment import page
  • BUG-4337105 - IDV-Exception after switching between views
  • BUG-4338138 - Access denied error during a state transition when 'has review' guard is used
  • BUG-4342934 - Left tree does not filter after item deletion
  • BUG-4343057 - Computed table field causes Null Pointer Exception
  • BUG-4343817 - The Test Run specified "Test Cases" and "Test Step Results" fields are empty in Traceability Browser
  • BUG-4346205 - Workflow actions do not support parameters or fields of type color and URL
  • BUG-4347988 - Project Deployment - Wrong error message in case of uploading invalid file
  • BUG-4347994 - Missing Translation - Error message at Project Deployment import page
  • BUG-4348452 - Permanent link - resizable columns has flaws with permanent link in document edit and saved report view
  • BUG-4348903 - Violation of Froala License Terms
  • BUG-4355299 - Cannot edit description of dependent item after dependency creation
  • BUG-4356693 - Error can be found in the log after Test online installability with post install process on Windows
  • BUG-4359904 - Inconsistent use of Gradle configurations
  • BUG-4364987 - [XSS] Script vulnerability on release page
  • BUG-4366364 - Editing change handler condition gives error message
  • BUG-4366367 - RPE report created from baseline does not show the data from the baseline version
  • BUG-4366463 - Condition with single argument is not valid any more
  • BUG-4366532 - Condition with ANY option corrupts AND/OR logic
  • BUG-4366668 - Item doesn't exist in outline: 2690162 may block document view rendering
  • BUG-4366746 - Project Browser - The project order is not correct after rearrange.
  • BUG-4366774 - User name is not logged during logout
  • BUG-4366775 - No exporting of reports by RPE for "not-System Administrators"?
  • BUG-4366786 - Project Browser - The project's more menu is visible when the project went backward.
  • BUG-4366800 - Image rendering markup changes to invalid link upon creating review
  • BUG-4366818 - Project Browser - The project card movement effects are not consistent.
  • BUG-4366911 - Project Browser - Moving the project inside of the green highlighted area cause effects on the category.
  • BUG-4366955 - Project Browser - Moving a project above a category (in tree) then back is changing the category.
  • BUG-4368187 - Project Browser - The more menu does not disappear during the scrolling.
  • BUG-4368229 - Project Browser - Loading back the name of a Project Category is not correct in some cases.
  • BUG-4370050 - Reports - embedded report filter does not display any values for reference fields
  • BUG-4375179 - TraceabilityMatrix can be for remote code execution
  • BUG-4375205 - Not every item exported into Word or Excel from Traceability Browser
  • BUG-4375208 - Not understandable info message shown sometimes during exporting Traceability Browser
  • BUG-4375848 - In the History tab in a Test Run of Test Case details page, the New Value and Old Value columns are slipped
  • BUG-4381817 - Document View permission error in baseline mode after item deletion
  • BUG-4383135 - Inherited tracker views (transition guards, workflow conditions) are not exported, when exporting a project as a template
  • BUG-4383790 - Upgrade from 9.4 to 10.1 fails with a trivial SQL error
  • BUG-4386309 - Email notification - Review Hub - The email notifications are not sent after saved comments.
  • BUG-4388367 - Review Hub - HasReview transition Guard throws AccessRightsException if transition executed by user in a group without Enable Review group permission
  • BUG-4388635 - Project Browser - Project List - Not just the dragged card is moving.
  • BUG-4390294 - Test management - Inner re-run - The order of the test cases are not the same as the test run details page
  • BUG-4391064 - Inconsistent number of comments in document view
  • BUG-4393237 - Account ".." is not authorized to access document: -1 (revision: null) error when opening an attachment in the description
  • BUG-4393552 - Auto-expand won't work in Document View for a specific tracker
  • BUG-4393572 - Irritating behaviour if no floating licenses left
  • BUG-4394968 - Traceability Browser - Manage Presets- Open the selected preset in a new tab, and the preset opens in Report View mode
  • BUG-4395725 - Review search does not work if search text contains a "
  • BUG-4397084 - Project Browser - Project List - It is not possible to open the more menu of a project if its size is large.
  • BUG-4402307 - Empty warning and error section appear when open the diagram editor (from not a popup)
  • BUG-4402521 - Report saving with the same name doesn't overwrite the old report
  • BUG-4402536 - Drag & drop column header to the Filter bar does not work in Table view
  • BUG-4402550 - Extending Import from DOORS - Description loss while importing from DOORS&converting to TestCases
  • BUG-4402649 - Different user date format is not supported in historical date filter
  • BUG-4406276 - Filtering doesn't work in reference field configuration
  • BUG-4406589 - Item Id filter does not support long field values
  • BUG-4406755 - Traceabillity Browser ignores field permissions in case of using expert filter
  • BUG-4406781 - Document View - Tree child counts does not work from level 4
  • BUG-4407474 - Rich text editor breaks valid links with custom protocols allowed in application configuration
  • BUG-4409957 - Reference selector overlay - Show Ancestor Items and Show Descendant items options are not working in case of single fields
  • BUG-4410050 - Reference Selector - Clear selection button increases number at summary text
  • BUG-4410126 - Wrong error message appears during Word Export in case of using invalid template
  • BUG-4410253 - [XSS] Create/Edit wiki page
  • BUG-4410594 - Test management - Test run - Set Finish status in copied item - the copied results are appeared
  • BUG-4410799 - Item is not visible in the tree in document view if the user has no access to it's parent
  • BUG-4410852 - [XSS] Release stats page
  • BUG-4412311 - [XSS] Requirements Library configuration
  • BUG-4413551 - RPE export freezes after invoked by codeBeamer
  • BUG-4413597 - When SAML configured, Invite by email creates duplicate accounts
  • BUG-4415676 - Missing property names for many standard fields in Swagger API
  • BUG-4424290 - Sensitive information leaked via cb.txt
  • BUG-4426024 - Tracker Item - In some cases, after a baseline or a branch creation, the history tab needs double refresh to show the correct state
  • BUG-4426249 - Adding new child to an item while it is closed causes error
  • BUG-4426674 - Test management - Custom field default values are not working when creating new item in test cases table view
  • BUG-4426972 - Test Management - Custom fields - I cannot navigate with tab in Item details page edit mode
  • BUG-4428184 - Table view - after selecting a saved custom filter (view), the table is not filtered
  • BUG-4428320 - Table view - User without Summary field edit permission cannot open the Item after trying to edit its summary
  • BUG-4428326 - Submodule not shown for created tag in Branches&Tags
  • BUG-4428599 - Clicking Right+Mouse click on Planner loads the right panel and opens item in new tab
  • BUG-4429010 - Report page navigation links are not working in Report jobs email
  • BUG-4432696 - When using filters, Word Export is using filters in GET query
  • BUG-4435263 - System Administration - Callback URL - There is a 1 minute delay between setting wrong callback URL in Application Configuration and displaying related warning message
  • BUG-4435306 - Test Management - Error when copying a Test Case to other Test Case type tracker
  • BUG-4435787 - Pull request pagination does not work at all
  • BUG-4438084 - Starring project does not work correctly
  • BUG-4441745 - [XSS] Tracker Home Page Configuration
  • BUG-4442760 - Tracker shows items of another tracker
  • BUG-4450525 - Post install - Post Install does not work with MySQL 8.0
  • BUG-4454165 - REST API Authentication fails with Bearer token
  • BUG-4457902 - Slow tracker tree hierarchy
  • BUG-4461052 - [XSS] Reports Properties
  • BUG-4461373 - Cryptic text appears in fields if hide if option is used
  • BUG-4463863 - [XSS] Member fields
  • BUG-4466108 - WYSIWYG editor component toolbar options does not work correctly.
  • BUG-4467932 - Previously entered texts appear as auto suggestions for date fields in tables
  • BUG-4468936 - Slow tracker configuration save
  • BUG-4469942 - Wiki Page Revision using previous version can cause Exception when invalid version is provided
  • BUG-4470788 - [XSS] Service Desk Configuration page
  • BUG-4472613 - Panel and Detailed View usability improvements and mistakes
  • BUG-4472819 - Hostname lookup fails if codeBeamer is behind a proxy
  • BUG-4474115 - Reports - Include filter does not work on reports page after switching between advanced and simple mode
  • BUG-4475242 - Error occurs in sending email using smtp.gmail.com when trying to reset password
  • BUG-4475797 - Test Management - Cursor will jump to the end of the selected row when clicking into a non-editable field in Test Runner
  • BUG-4477408 - WRO IE8 validation rules fail because of a leftover trailing comma
  • BUG-4478280 - Installation - After a successful server stop, there are still some threads running causing possible memory leak
  • BUG-4478876 - Baseline - Artifact link parameter contains version instead of revision
  • BUG-4485558 - "mandatory single none" fields default value is not set during quick transitions
  • BUG-4485859 - Markup code of the picture inserted to Wikitext field is changed autonomously
  • BUG-4486014 - Table view - Cannot add new column if the table overflows the screen
  • BUG-4487675 - Intelligent Document View invalid permission check on tree nodes
  • BUG-4488062 - Test Management - Mandatory check should ignore Hidden/Hideif fields on Item details page and Document view middle panel edit mode
  • BUG-4488222 - Handle more than 1000 Projects in query
  • BUG-4489368 - Moving item to different tracker by changing parent destroys hierarchy
  • BUG-4489396 - Test management - Test cases Excel import - The date and choice custom test step field gives error
  • BUG-4489409 - SSO logins do not clear Browser Local storage after successful Login / Logout procedures
  • BUG-4489411 - Excel export is not working with Historical filter and with two trackers on the Initial Level in Traceability Browser together.
  • BUG-4489603 - Document View - Document View changes to Intelligent Document View after clicking GO in Traceability in another browser tab
  • BUG-4489783 - Reference filter shows only 500 items when configured references are prefiltered implicitly
  • BUG-4489829 - Creating a 'Tracker Item' using Swagger API unnecessarily requires 'customFields' reference in the body
  • BUG-4490836 - Investigate the possible Member Search Indirectly Assigned Members malfunction
  • BUG-4491638 - Document View Mass Edit - Recursive Mass edit only modifies the items that are loaded in the left tree
  • BUG-4491663 - Associations - only the last created association is displayed in document view right panel if different type associations exist from the same source item to the same target item
  • BUG-4491772 - Reqif import can break tracker tree folder structure on Trackers page
  • BUG-4493127 - Decimal fields have the wrong value model in /trackers/{id}/schema
  • BUG-4493290 - Maximum number of Cell Styles was exceeded during big Traceability and Coverage Exports
  • BUG-4493584 - Chart widget - Highchart error in console, area chart does not work properly
  • BUG-4493698 - IDV - insert item options are missing from center pane context menu
  • BUG-4497707 - Allowed/Default values - Country and Language type field allowed/default values are not working in case using table fields
  • BUG-4498029 - Configuration deployment - tracker views are updated instead of recreated
  • BUG-4498076 - Swagger API: Status change is not possible if status field is read only in the target status
  • BUG-4498100 - Test management - Custom fields - If the step values are the same, the duplicated dialog does not appear
  • BUG-4500095 - Document view middle section selection is not cleared
  • BUG-4502196 - Document Edit View - Cannot add multiple shared field as table column
  • BUG-4502303 - Test Management - In document edit view, hide if field is visible when the condition is fulfilled.
  • BUG-4502304 - Traceability SQL exception when using History filter with Upstream reference filtering using Associations
  • BUG-4502365 - Test Management - Error 500 when opening Test Set node in the library tree
  • BUG-4502460 - Reports - Historical filter gives back different item versions in table and in document/Card board view
  • BUG-4506139 - Importing DOORS data leads to multiple account creations
  • BUG-4507018 - Upgrade - 9.5 to Carmen upgrade failed, codeBeamer doesn't start
  • BUG-4508139 - Tracker Items - InPlace editor - Reference field - if the field has 155+ reference value the InPlace editor throws "REST-URI too long" console error
  • BUG-4508140 - Test management - If there is a step with a referring item, it is editable in Document Edit view and Table view
  • BUG-4508241 - In a derived project, Kanban board still checking the possible workflows in parent project
  • BUG-4508275 - Project Configuration Merge - Target field is marked for deletion, but still selectable as choice in another field as target - causes duplicate mapping error
  • BUG-4508400 - Navigation bar not appearing when creating project from template
  • BUG-4508405 - Hidden state transitions are visible to all users
  • BUG-4508539 - Sanitize non-printable characters at ReqIF export
  • BUG-4508541 - Oracle SQL timeout when browsing Document View
  • BUG-4512273 - Traceability Browser - Reference to filter is not working with Baselines
  • BUG-4512483 - Swagger API has wrong documentation
  • BUG-4512514 - Automatic SAML login does not work when the session has expired
  • BUG-4512543 - Incorrect field permissions in baseline
  • BUG-4513673 - Uncaught TypeError: Cannot read property 'tableViewSelection' of undefined
  • BUG-4514078 - Test management - Custom fields - During Excel import the choice, members type test step field values cannot be imported
  • BUG-4514080 - Test management - Custom fields - In Excel import the date field gives error if I added the date in the excel, not copied it
  • BUG-4514082 - Test management - Custom fields - During Excel import if there are more steps with empty custom fields, I get error messages because of "null" value
  • BUG-4516434 - Traceability Browser - Suggested trackers information box is missing for some users
  • BUG-4518470 - Document View - Library panel filter misses Tracker Types
  • BUG-4518590 - Test management - I cannot add a test step column to Document Edit View in Test Cases tracker. There are errors in console in Document View and Table View too.
  • BUG-4518853 - SQL Exception: Cannot add foreign key constraint during upgrade to 20.11-Snapshot2 on CTS
  • BUG-4518964 - Test Management - Text formatting does not appear properly on some views in case of editing custom wikitext type fields
  • BUG-4519325 - Invalid reference item can be saved using Recently selected feature
  • BUG-4519329 - Reference selector dialog closes when trying to filter
  • BUG-4520667 - Test management - Custom fields - Running dialog - If the wikitext field is in Markup mode, and click on Pass step after the value is added, the value is not saved
  • BUG-4520808 - Test management - The image does not appear in bug report
  • BUG-4521152 - My Current Items widget - the widget can be ordered by any of the columns, unexpected error in the preview
  • BUG-4521153 - Swagger API is not returning formula for some fields
  • BUG-4521314 - Filtering does not work on planner view when no Color field found for related trackers
  • BUG-4522986 - No or incorrect picture is shown in wikitext field
  • BUG-4524375 - Test management - If only the custom field is modified in the referring item, the item which reuse it it is not refreshed
  • BUG-4524538 - Cannot send tracker item to Review Hub: Cannot read property 'trackerItems' of undefined
  • BUG-4524608 - Importing with custom choice field if there are similarly named users cannot be mapped into the choice field
  • BUG-4525243 - Test management - Custom fields - In the running dialog if I upload an image to wikitext type custom field, there is an invalid link
  • BUG-4525866 - Cannot re-import ReqIF because of 0 byte attachment
  • BUG-4532669 - Report - Open a shared report cause Uncaught JSTORE_JRI_CONFLICT
  • BUG-4532717 - Report - Historical filter cause NullPointerException
  • BUG-4533530 - License/Application Configuration - Any change in the Application Configuration changes the license on the instance
  • BUG-4533606 - Status change icon is visible in baseline mode
  • BUG-4533723 - Project Calendar of a project -which created based on a template project- can not be changed
  • BUG-4534216 - Oracle exception during Carmen upgrade
  • BUG-4534386 - Dashboard widget - missing No Group field in case of Chart widget
  • BUG-4535317 - Global Messages handler can cause Concurrent modification exception
  • BUG-4535578 - Images are not imported from excel file
  • BUG-4535712 - Project Deployment - Deployment fails after an attempt with a user with no permission
  • BUG-4536081 - Doc view - tooltip on tree node contains HTML escaping
  • BUG-4536118 - Reference filter setting lost in configuration after project export/import
  • BUG-4536339 - Review Hub - Parent folder also shown as changed when filtering
  • BUG-4536429 - Javascript does not compile
  • BUG-4543034 - Baseline - Document Edit View is visible on center panel in Baseline mode when Default layout is Document Edit View
  • BUG-4543709 - Merge of two branches doesn't show correct differences
  • BUG-4546602 - Test management - Custom fields - If I upload a big sized image/file to the wikitext custom field and click on another field before the uploading process ends, the image do not appear
  • BUG-4546726 - No items in tracker baseline
  • BUG-4548366 - [MySQL Only] - Upstream References list shows items which does not match with the corresponding filters
  • BUG-4549455 - Wiki links to items containing some special characters get corrupted after ReqIF export/import
  • BUG-4559950 - Comment's update history is not displayed in the work item history
  • BUG-4563017 - Test Management - Test run generation is very slow and not working
  • BUG-4564978 - Temporary tables are not cleaned after usage
  • BUG-4565680 - Moving item from Functional Test Cases tracker to Regression Test Cases tracker not working on cb.com
  • BUG-4565829 - Do not allow identical field names
  • BUG-4568117 - Test management - Custom fields - In test cases tracker if I add invalid value to the custom test step field, it does not appear
  • BUG-4568130 - Items cannot be sent to review from Table View
  • BUG-4568674 - severe problems with workflow-action-conditions after update to cB10.1SP1
  • BUG-4571377 - Branching - Tracker branches does not keep the item hierarchy
  • BUG-4571625 - Import does not update the tracker ID of conditions
  • BUG-4571677 - ReqIf export fails when preserve hierarchy option is used
  • BUG-4571772 - CodeBeamer service name - Null appears instead of actual version in Task Manager.
  • BUG-4571940 - Baselined tracker in Document View loads Head version of items after scrolling down in center panel
  • BUG-4574526 - Reports - Expert filter Group or Order by can cause java.lang.IndexOutOfBoundsException
  • BUG-4574868 - Tracker inheritance cannot be switched back after having a shared-field associated field removed in parent
  • BUG-4580033 - High loading time of items in test trackers
  • BUG-4582183 - When only one record is compared on Tracker Item Details Page - History tab the page throw 404.
  • BUG-4584414 - Performance decrease factor 300 if user has "View if Owner" permission only
  • BUG-4584560 - Test management - Custom fields - If the custom test step is has default value and it is mandatory, there is an error about missing mandatory field
  • BUG-4584933 - Test management - I cannot download the file which I uploaded in the running dialog
  • BUG-4584987 - Unable to add child item to another tracker item using the Swagger interface
  • BUG-4587974 - Test management - In test run Details of test result section the long column names do not fit in the column
  • BUG-4588059 - [Oracle] Planner content is not loaded in center pane
  • BUG-4588097 - Test management - Reusable only checkbox does not work well in Test case item details page
  • BUG-4588328 - Document view - left tree filtering causes deadlock
  • BUG-4588337 - Traceability browser - Items are only displayed at Initial and first Level with Historical View filter
  • BUG-4600465 - Intelligent Table View shows the default view
  • BUG-4600481 - Test management - Action column aligned badly, if Critical action is true
  • BUG-4600636 - Document View / Summary not readable in "middle of screen"
  • BUG-4600644 - Test management - Custom fields - the wiki text type custom field value is deleted in case of using "Insert new step before/after this" icon
  • BUG-4601344 - Can't set custom Url field through v3 api
  • BUG-4601570 - Test management - Duplication handling flaw in quick assign function of Test Cases to Test Sets
  • BUG-4602738 - Test management - The Test Run item name generated from a Test Set is not contain the Test Set item name
  • BUG-4602756 - Branching - Cannot add new item on branch (500 error in console and NPE in error log)
  • BUG-4602945 - Test management - The diagrams with more shapes does not appear in Test Cases Table View and Reports menu
  • BUG-4603016 - Branching - Item doesn't exist in outline
  • BUG-4603026 - Clicking on "Edit Steps" does not create empty steps
  • BUG-4603027 - Branching - Branched tracker name should look like branchName » TrackerName
  • BUG-4603047 - Release filter disappears when selecting tracker on Downstream/Upstream reference cbQL filter dialog
  • BUG-4603143 - Reports - Item with removed suspected reference is still listed in a Report where Suspected Link filter is used
  • BUG-4603151 - Cannot save custom report based on an existing one as a custom role
  • BUG-4603406 - Tracker Views - Load a tracker view cause NPE exception
  • BUG-4603552 - Test management - Custom fields - In the reported bug from test run, the members, language, country, duration type field values do not appear well
  • BUG-4603695 - Summary not shown in Document View Tree
  • BUG-4606163 - Problem with mapping multiple columns at Excel import
  • BUG-4606194 - Summary is not shown in the left tree in case of Intelligent Document view
  • BUG-4606457 - API call to move item is ignored silently
  • BUG-4606460 - Check possible Calculated Field update database performance problem
  • BUG-4606496 - JIRA Link import doesn't work with JIRA Cloud
  • BUG-4611004 - Test management - In table view and Document Edit View the values in In design status are not saved in the attached project
  • BUG-4611006 - Test management - Formality field is not exported from Test Run to MS Word
  • BUG-4611435 - Test management - Custom fields - The field values are misaligned in Document View
  • BUG-4611452 - Wiki Export - Not able to open exported file when filter NonPrintableChars is set to true
  • BUG-4611467 - Reused test step references lost at target location when moving item
  • BUG-4611475 - Filtering for Integer type fields not working when importing data from Excel
  • BUG-4611586 - Document Export - Duplicated hyperlinks in Word Export
  • BUG-4613215 - Test management - Filtering for Skipped Test Cases not works on Test Runs Result
  • BUG-4613283 - Test management - Missing German translation in case of reusing test step in Test Case Item Details page
  • BUG-4613308 - Word Export - Export selection is not working from Table View
  • BUG-4613376 - Test management - English test formality values on Deutsch UI
  • BUG-4613491 - Roundtrip Word export - only description is editable in the exported roundtrip file
  • BUG-4615116 - Knowledge base word export fails
  • BUG-4615780 - Tracker Items - Test Cases are not displayed correctly
  • BUG-4616868 - Coverage Browser - inconsistent state after filtering
  • BUG-4616958 - Document view - left tree D&D performance issue
  • BUG-4618450 - Report - saving report shows unexpected identifier error and does not load the roles dropdown
  • BUG-4620340 - /v3/trackers/{trackerId}/outline not usable
  • BUG-4620832 - Custom TestStep field is not highlighted correctly when it is reused
  • BUG-4620849 - WYSIWYG editor Heading1 style is missing when the WYSIWYG editor is small
  • BUG-4621051 - Missing upload button from TestStep's wiki editors
  • BUG-4621452 - Test management - Critical "?" icon missing from Test Run item details page.
  • BUG-4621468 - In Copy To, Move To dialog selecting other project without Destination tracker gives "404 - Page not found"
  • BUG-4622296 - Test management - Unnecessary window appears for concurrent user during sequential Test Run
  • BUG-4623683 - Excel import - Excel import is not working due to missing cb-excel-import-integration.jar
  • BUG-4623684 - Workflow Action field updates does not set formula in every necessary fields
  • BUG-4623735 - 'Automatic' SAML login causes infinite loop when user try to log out
  • BUG-4625011 - Test Management - Right panel missing from Test Set creation window
  • BUG-4625326 - Test management - Right panel is missing from Test Case creation window
  • BUG-4625436 - IDV - References are missing after DnD an item in the tree
  • BUG-4625485 - Wiki rendering & Wysiwyg editor - <<Description>> link stereotype does not work
  • BUG-4626013 - Test Step reuse is not rendered correctly on the table-view or right panel of doc-view
  • BUG-4626018 - Test management - Test step reuse - If I copy a step and use it as reference too, breaking a reference function does not work well
  • BUG-4626559 - Test management - Test Cases - There is a plus step if I add step from the right panel
  • BUG-4626560 - Reports - Using historical view and "order by outline" together, result items are displayed multiple times
  • BUG-4626726 - - Tracker List widget: Icons not visible
  • BUG-4629180 - Project Creation - Project import fails when 0 byte size file available in importable template file
  • BUG-4630789 - Document View & Document Edit View - Center pane does not navigate to the item, what was selected in the left pane
  • BUG-4631992 - IDV - Root item of the tree disappearing after DnD
  • BUG-4632106 - Regular user with Developer group cannot create view in Planner View
  • BUG-4632156 - Test Management - Pre-Action and Post-Action input area reduction
  • BUG-4632182 - Document View - with active tracker view, switching to document view loads all the items
  • BUG-4632189 - Document View - Document view item does not have "updated on branch" badge on center pane after a refresh
  • BUG-4635953 - Wiki page - The uploaded files can't downloaded from the Wiki page
  • BUG-4636183 - Excel export - uploaded xlsx template cannot be used
  • BUG-4636303 - Ticking Referring Items in configuration of a tracker still shows the referring item icon
  • BUG-4636308 - Shared field columns are not shown in saved views on Table View/Document Edit View after switching back from default view
  • BUG-4636593 - Post Install - Cannot start codeBeamer post install
  • BUG-4638711 - Excel master template - any kind of file is uploadable not only xlsx
  • BUG-4639069 - Excel master template - Information loss when exporting coverage browser into excel using master template with header/footer
  • BUG-4639472 - IDV - NPE after set an Intelligent View on active saved tracker view
  • BUG-4640260 - Exporting "copy of" results in syntactically incorrect ReqIF
  • BUG-4640276 - Cannot remove password recovery link from login page
  • BUG-4642479 - Workflow Actions - Workflow action is triggered even if the Condition is not satisfied with Quick Transition disabled
  • BUG-4642485 - Installation - master is broken, cannot create installer
  • BUG-4642539 - Test step reference is broken when having Read on TestCases
  • BUG-4642551 - Sticky header - if this feature is on, when I scroll down the center of the page sticks to the header
  • BUG-4642834 - Reports - I can not select disabled user when I use a member filter
  • BUG-4642924 - Table view - Select all/Clear all checkbox is on If I clear all selection with the function
  • BUG-4644608 - External Images Result in Incorrect ReqIF
  • BUG-4644609 - Images referenced by CB:// URL Result in Incorrect ReqIF
  • BUG-4645004 - IDV - NPE after adding new items on Intelligent Document View
  • BUG-4646861 - Custom Wiki Link/URL field inline edit does not work, and broke whole page inline editing capability
  • BUG-4646864 - Wiki Link/URL field link insertion does not work in item details page edit mode
  • BUG-4646865 - Wiki Link/Url Field - File/Report link version badge is not rendered in document view right panel after save
  • BUG-4647000 - Tracker views - result list not correct if I grouping but after I select a choice type field with options
  • BUG-4647001 - Wiki Link/Url Field - Report link with version cannot be opened, just the HEAD
  • BUG-4647003 - Can't select source if ReqIF does not contain repository ID
  • BUG-4647010 - Wiki Link/Url Field - selected URL is rendered as undefined/empty token with or without alias given
  • BUG-4649579 - Security scan - HTML content injection - We need to disable Html parse in editor by default
  • BUG-4649580 - Security Scan XSS possibility using special setting of Account save procedure (Cross-site scripting)
  • BUG-4649584 - Test management - Recursive inclusion is not asked if Test Set created from multi-level parent Test Case
  • BUG-4649597 - Security scan - XXE (XML external entity injection) using modified Import XLS file
  • BUG-4649602 - Security scan SSRF (Server-side request forgery) - Do not accept hashtag characters in Jira Server field
  • BUG-4649719 - Project import - Saved views are missing after project import
  • BUG-4649955 - Tracker fields lose their focus in item editing mode
  • BUG-4654094 - Document View - Cannot delete item from left pane
  • BUG-4654109 - Document View - New item is disappear from center pane after change a properties on the right pane
  • BUG-4654119 - Reports - Unexpected error when trying to save a report
  • BUG-4654162 - Document View - Add item link is missing from empty tracker
  • BUG-4657662 - Tracker views - Navigate to Document view option does not work if the default tracker view is not Document view
  • BUG-4657731 - Tracker Views - Select Reference dialog filter is broken, cause Cannot read property 'saveTrackerView'
  • BUG-4657937 - Test Run Browser - Statistics query timeout
  • BUG-4657958 - Shared fields are not saved in columns for Views
  • BUG-4658169 - Linux installer contains MySQL 8 driver by default
  • BUG-4658325 - Froala Editor - An error message appears in the overlay window when editing a field of type wiki text
  • BUG-4658469 - Test Management - Can not open a test run
  • BUG-4658486 - Tracker Items - Generating items from document view runs into syntax error
  • BUG-4658573 - Tracker view widget - Error during Mass Edit
  • BUG-4658576 - Test Management - Can not generate test run
  • BUG-4658711 - Document View - Export to Office does not work with right click on top of the left tree
  • BUG-4658718 - Tracker Items - Test Set items not loaded if a TC is in association
  • BUG-4658791 - Intelligent Document View - New Downstream reference cannot be created from reference item
  • BUG-4658926 - Test Management - JS error instead of codeBeamer error popup during test step save
  • BUG-4659003 - Workflows - State transition cannot overwrite value
  • BUG-4660171 - Document View - Descendant item node cannot be opened in the left tree
  • BUG-4660716 - Wikilink/URL field - After artifact link insert from search tab to Wiki link field, overlay is not closed
  • BUG-4662466 - Post install - Can not install codeBeamer with MySQL 5.7 / Oracle 19.3 / Postgres on Windows
  • BUG-4664706 - Traceability Widget - second page shows "Nothing found to display" instead of the items
  • BUG-4664731 - JIRA import - Exception when rendering items after JIRA import
  • BUG-4665188 - Incorrect missing items collection on Intelligent Document View
  • BUG-4667089 - NPE on intelligent document view
  • BUG-4667091 - Upon importing a project template, where tracker fields have default values or allowed values per status, the default/allowed values (at least if they are roles), are removed
  • BUG-4667159 - Word Export - faulty error message when trying to export more items then the limit by selection
  • BUG-4667160 - Tracker Item Review: After review was successfully approved, cannot go back to the status associated with review reject
  • BUG-4667438 - Can not upgrade already existing big database schema to latest version because of special Artifact types
  • BUG-4668774 - Unexpected system error when adding new association
  • BUG-4670568 - Filtered Release Dashboard list may throws 404
  • BUG-4670776 - Perf bottleneck analysis requested for mass Test Case creation via API
  • BUG-4670891 - Custom Field values disappearing after saving a report
  • BUG-4671014 - Problem Syncing Recreated User
  • BUG-4671216 - Test Management - No error message about missing test step action during test step save
  • BUG-4671539 - Intelligent Document View - Error while loading the tree
  • BUG-4672357 - JIRA Sync not disable if log in not possible
  • BUG-4673557 - Tracker views - Configurations icon is not clickable because component position changed
  • BUG-4674199 - Tracking Test Results via Swagger API is unbearably Slow
  • BUG-4674406 - Test management - Wiki link field editing does not work in test steps
  • BUG-4674623 - Document view - View is not loaded when layout_name is not specified in URL
  • BUG-4677342 - Check the lock information as a bulk operation on document view
  • BUG-4678071 - Jira Sync Fails if there Are Empty Attachments
  • BUG-4678072 - Dashboard widget - Chart widget - Gauge chart and Speedometer chart don't work
  • BUG-4678935 - Reports - Request to '/query' has failed error message appearing after try to delete a report
  • BUG-4680098 - Tracker View - Branched tracker's view does not filters correctly
  • BUG-4680104 - Loading Downstream references and Wiki references can be slow if there are plenty of them
  • BUG-4680551 - Reports - Unexpected error when trying to save (overwrite) a report which name has already existed
  • BUG-4680571 - Tracker View - New default public view not loaded correctly
  • BUG-4680582 - Tracker Views - Revert changes does not work on release tracker (planner, kan ban)
  • BUG-4680647 - NullPointerException exception during DOORS Bridge import
  • BUG-4680691 - Planner - Left pane release release item and SP counter does not update
  • BUG-4683253 - Required Panel is not updated properly when user changed field value and a field become mandatory
  • BUG-4683360 - Tracker items - Columns are misaligned in Work Item history tab
  • BUG-4683556 - User Interface - Border appears when no Action Icon defined
  • BUG-4684367 - SQL Exception during codeBeamer start on oracle
  • BUG-4684551 - After change username to an XSS code - user popup layout is awfull
  • BUG-4684633 - Intelligent Document View - Editing item from center panel is not working properly
  • BUG-4685187 - Document Edit View - Uncaught TypeError when expanding a node in the left tree after saved IDV view is loaded
  • BUG-4685480 - User Interface - In filter 'Tracker Type' dropdown items are not interactable
  • BUG-4686774 - Project Deployment - Check All option works incorrectly
  • BUG-4686840 - Project Deployment - Import fails if the export file contains a tracker that created from template
  • BUG-4686878 - Tracker items - In 'Item Edit Page' clicking on save mandatory field won't be highlighted
  • BUG-4686988 - Tracker items - In item edit page description test comment does not work
  • BUG-4689781 - User interface - Reference item icons are wrong in Item details page Traceability section
  • BUG-4690026 - User interface - Not only supported file format and file size is accepted
  • BUG-4690300 - Test Management - UI bugs in 'New Test Case' context menu
  • BUG-4690594 - Test Management - 'New Test Case' dropdown is trimmed if more than twenty Test Cases tracker is configured
  • BUG-4690933 - Wiki markup parser cannot find special internal links in markup
  • BUG-4691311 - XSS Alert pops up on Tracker Config page
  • BUG-4691312 - Test Management - Unresolved icon resource in test run page
  • BUG-4691912 - Document Export - Attachment export works only on initial level
  • BUG-4692382 - User Interface - Icons do not have the same size on Tracker List
  • BUG-4692383 - Wiki Fields appear incorrectly in the test runner if editWiki Fields In Overlay is true
  • BUG-4692808 - User Interface - Branches do not inherit custom icon settings
  • BUG-4692816 - EMPTY / NOT EMPTY filter does not work for custom member fields containing groups
  • BUG-4693415 - Tracker Item Review - 'Reviewed by' filter does not apply correctly after an item has commented
  • BUG-4698748 - Project config merge - Custom icons are not displayed after project config merge
  • BUG-4699341 - Project config deployment - Custom icons are not displayed after project deployment
  • BUG-4700418 - Tracker items - Table fields - Empty table row is saved although the table fields were filled
  • BUG-4700500 - DB upgrade from Betty.SP1 runs Betty.SP1 scripts too
  • BUG-4702398 - Filter checkboxes cannot be clicked
  • BUG-4702405 - Mandatory If - Inline edit fails, even with mandatory field edit overlay
  • BUG-4702489 - Tracker Edit - Adding an item twice as a value of a choice field causes an invalid error message
  • BUG-4702505 - Context more menu of result table columns are not disappearing after clicking on a submenu
  • BUG-4702535 - Tracker views - Using 'Intelligent Documentum View Configuration' Disable function won't reset basic document view
  • BUG-4702674 - Column names does not disappearing (and could overlay other columns) after moving them by dragging
  • BUG-4703009 - Planner - Left pane context menu appears in a wrong place
  • BUG-4703051 - Tracker view widget/Reports - If the shared field is a text or wikitext type field, none of the new operators works
  • BUG-4703130 - Planner - GroupBy and OrderBy stays disabled after switch to another view
  • BUG-4703265 - [BranchTest] Tracker Views - AND/OR Logic is empty or invalid. Please modify or remove AND/OR Logic after relogin
  • BUG-4703389 - Test management - Error when uploading an attachment to the description of a test run during rerun
  • BUG-4706176 - Value of Shared Field Typed Member/Group not displayed on view load
  • BUG-4706182 - Intelligent Document View - Reference item is disappearing when dnd it on the parent initial item
  • BUG-4706211 - Moving an item to a new group is not possible in the ordered backlog
  • BUG-4706425 - User should be able to select groups for filtering even no Projects are selected.
  • BUG-4706555 - When an Item is suspected the suspected icon in tree is gray not red
  • BUG-4706931 - Mandatory if - Choice type Fields should fit into edit Mandatory fields overlay
  • BUG-4706970 - Test Management - Unexpected error in case of open a deleted test case from a test run
  • BUG-4708195 - Tracker Views - Loaded view and filters are not saved when switching between tracker views
  • BUG-4709657 - VetoException in Workflow Scripts does not work as intended
  • BUG-4709699 - Post-transition script actions can't cancel transaction
  • BUG-4709817 - Custom Script Executor Actions Timeout Silently after 2 Seconds
  • BUG-4710787 - Test Management - Mandatory fields are not marked with red star at test steps fields
  • BUG-4710816 - DOORS Bridge - Tree hierarchy is different in cb after importing from DOORS
  • BUG-4710942 - credits.html not included in codeBeamer distribution
  • BUG-4711083 - Test Management - If Test Case is created from Test Set creation, then Test Case is added to Set, regardless of allowed status
  • BUG-4711324 - codeBeamer credits.html contains entries related to Doors Bridge only
  • BUG-4711551 - DOORS Bridge - Deleted and Purged item is not deleted in cb
  • BUG-4711707 - Tracker Items - An error message appears when save the Edit mandatory fields overlay with Enter button
  • BUG-4711915 - Document view - Equals to filter is not working with negative numbers in document view and document edit view
  • BUG-4715470 - Anonymous user can call getInitial DocumentView CenterPanel AndTree method and cause possible exception
  • BUG-4716331 - Menu icons sizes are not correct
  • BUG-4716995 - Mandatory IF - The uploaded file doesn't appear after saving the Edit mandatory fields overlay
  • BUG-4716996 - Baseline: item link contains version instead of revision in document view in baseline mode
  • BUG-4717015 - Upload button is missing in inline table-editor on table view: when editing a table with wiki fields (for example the TestStep's editor)
  • BUG-4717220 - User Interface - Branches do not inherit custom icon settings if tracker is created from tracker template
  • BUG-4717888 - '>' and '<' characters are not escaped in field name
  • BUG-4718070 - Tracker item - Mandatory choice/boolean type field is highlighted wrongly with missing value
  • BUG-4722368 - User Interface - Filtering with two decimal digits is not working if second decimal digit is 0
  • BUG-4723408 - Inconsistent suspected link indication in document view tree
  • BUG-4723611 - Reports page - Show All not works well even if the result list contains less than 500 items
  • BUG-4723757 - Tracker view - Revert changes button doesn't work for the view data
  • BUG-4733179 - Test Run Work Item details page load fails because of missing "mandtest" or invalid Mandatory condition
  • BUG-4733502 - Error attempting to get column 'submitted_at' from result set. Cause: java.sql.SQLException: HOUR_OF_DAY: 2 -> 3
  • BUG-4734085 - Computed field test failed with Oracle
  • BUG-4734172 - Mandatory If - focus is not set on missing mandatory field editor, leading to multiple open editors
  • BUG-4736414 - Tracker View - Can not change invalid report on Planner after refresh
  • BUG-4736531 - Guard is cleared from configuration when editing it in derived tracker (also from template)
  • BUG-4737217 - Test Management - Custom date type test step field time is shifted after saving
  • BUG-4740095 - Login alignment is wrong
  • BUG-4741766 - Table fields' inline editor does not handle Boolean fields well
  • BUG-4741844 - Intelligent Table View shows the head version of items in Level 1 in a Baselined tracker
  • BUG-4742226 - ReviewListPlugin fails to render on wiki page
  • BUG-4742441 - Intelligent Document View - Version badges are not rendered/disappearing
  • BUG-4742442 - Tracker Item creation - Toolbar is missing when trying to add several items to a tracker on Document View
  • BUG-4742524 - Tracker Views - Baselines are not always relevant and correctly displayed in Historical View filter
  • BUG-4743858 - Incorrectly applied min/max values at reqif export/import
  • BUG-4746141 - Generate Test Runs - Cannot create test run because of Hidden/hideif + mandatory fields
  • BUG-4746612 - Reports - Clicking on Report Properties dialog save button throw "globalRoleType is not defined" error
  • BUG-4746957 - Wiki link/URL field - If alias is given on History or Search tab, then inserted token's name is wrong and version selector missing
  • BUG-4746970 - Unable to update/modify test-steps using Swagger API.
  • BUG-4746973 - Wiki link/URL field - Wiki link field value is copied to another Wiki link field value field in edit mode
  • BUG-4747083 - Intelligent Document View - Reference item is versioned when opening it from center panel
  • BUG-4747231 - Intelligent Document View - Page is not refreshing after renaming a reference item in the left tree
  • BUG-4747248 - Test Runner - Cannot finish test run when there is an editable + mandatory field, and the field is not filled.
  • BUG-4747327 - Test Management - Javascript error during Test Set creation on Table view
  • BUG-4747572 - Test Management - If only Folder/information type Test case is added to Test Set from doc/doc edit view left panel, then warning message fall short
  • BUG-4747992 - Document View - View is not switching back to basic document view after IDV rendering method is set to disabled
  • BUG-4749549 - Bug for "Check edit widgets on Dashboard" - Edit widget dialog title does not contain the widget name
  • BUG-4749772 - Test Management - Test Cases with not allowed status is in Test Set, when Set is generated from Test Case doc/doc edit view left panel
  • BUG-4749958 - The "Insert Table" functionality of the WYSIWYG editor does not work if the menubar is in sticky mode
  • BUG-4750522 - Tracker views - Yellow warning sign appears when I switch to another tracker views (and only switch)
  • BUG-4750527 - Document View - Export to Office functionality does not export items on Intelligent Document View
  • BUG-4750532 - Tracker views - If the default layout is Cardboard or Document Edit view it is not possible to switch to another view
  • BUG-4750703 - Test Runs - Hide if and Mandatory if functions are not triggered when condition is fulfilled (test steps)
  • BUG-4750750 - Tracker View - View change back to the public view after Tracker View changes
  • BUG-4750835 - Guard modified in inherited tracker updates template
  • BUG-4756188 - Items at Release/Sprint Start(End) Date historical filters do not show version number for items and they are editable
  • BUG-4756376 - Reports page - If I use Resizable columns, Show Children or other checkboxes in the saved report and open another page afther when I go back checkboxes not selected again
  • BUG-4756403 - User Selection Autocomplete - maximum number of expressions in a list is 1000 when using Oracle
  • BUG-4756456 - Test Management - Custom bool field in test steps, gets NULL value in editing
  • BUG-4756464 - Test Management - Add selected Test Cases to Test Set cause JavaScript error
  • BUG-4756733 - Reports page - If I modify a saved report when I open it again, never the saved report opens
  • BUG-4756837 - TrackerManager.setConfiguration() will not update field choice options, status specific settings, notifications, escalations, etc. if there is not at least one new setting.
  • BUG-4756843 - The scrolling ability ceases when saving WYSIWYG editor content in overlay mode
  • BUG-4757401 - Mandatory IF - Not all error messages appear in Document Edit View
  • BUG-4757494 - Document View does not display items after Test Steps table has deleted in Test Case tracker
  • BUG-4757704 - Post Install process terminates at Step3
  • BUG-4759181 - Item details page - Cursor switching back to the previously edited field when submitting a work item
  • BUG-4759233 - ReqIF Import does not Remove Associations and References
  • BUG-4764100 - Planner View - Adding an Order by custom field throws an error if we're not in the Product Backlog
  • BUG-4764215 - Report - Loading saved report shows a confirmation dialog with message: Are you sure you want to delete this Escalation View?
  • BUG-4764465 - Tracker View - Invalid AND/OR logic after change back to private view
  • BUG-4764470 - Test Management - Custom test step field which is not editable and readable, can be readable in edit mode
  • BUG-4764539 - Documents tracker - Drag&Drop column stuck
  • BUG-4764829 - Tracker configuration - Editable checkbox is visible on work item type tracker
  • BUG-4764897 - Document edit view - Mandatory check should ignore hidden/hideif + mandatory combinations
  • BUG-4766501 - MTS server - codeBeamer does not start after deploy
  • BUG-4766729 - Froala editor - Cannot edit description inline
  • BUG-4767274 - Mandatory IF - The overlay doesn't appear correctly in Document and Planner views
  • BUG-4767412 - Traceability - Project selector is displayed in preset edit overlay
  • BUG-4767543 - Mandatory if overlay - the overlay should not appear appear if a field is mandatory if + read only field
  • BUG-4767979 - Tracker views - unsaved warning appears when open a saved view which contains modified table header
  • BUG-4767980 - Excel export - missing indenting from Excel file exported from Reports page
  • BUG-4768011 - Word Export - Historical View filter is not applied when exporting to Word, HEAD is exported
  • BUG-4768271 - Post install - displayed error message about supported databases contains outdated/no database versions
  • BUG-4768379 - Traceability - Error happens if preset with Historical View filter is opened
  • BUG-4768474 - Traceability - Preset is not the same for different users
  • BUG-4768475 - Traceability - Preset is available for non-owner user by default
  • BUG-4769738 - Test Management - Duplication warning in quick assign function of Test Cases to Test Sets
  • BUG-4769960 - Test Management - Custom Wikitext type field edit area appears incorrect during test step edit if editWikiFieldsInOverlay is true
  • BUG-4769969 - Report - On Report View page version badges disappear after clicking on Show All
  • BUG-4770047 - Planner View - Setting Any project if there's a field as filter throws JS error
  • BUG-4770050 - Upgrade Process - Version only changed in version.properties file (*-database.sql files still on PRE7)
  • BUG-4770102 - Reports page - If I add a new column to the table header and I hit GO unsaved warning not appears
  • BUG-4770108 - Baseline - Open Table View item in Baseline mode navigates to HEAD version
  • BUG-4770212 - Froala Editor - Section comment creates invalid arrows
  • BUG-4770478 - Report - Saved report can be overwritten unintended
  • BUG-4770623 - Planner - Switching between Planner and KanBan Board cause unsaved view
  • BUG-4771051 - Can not select text using mouse & copy-paste inside Steps of TestRunner
  • BUG-4771324 - Test Management - Creating a downstream ref. from Test Set/Test Case kan ban board, resulted in not-existing-page
  • BUG-4771378 - The resizing ability goes away when clicking the GO button or adding a new column in the Document Edit view
  • BUG-4771564 - Reference filter configuration filter condition is ignored when using field dependency
  • BUG-4773936 - Adding and then removing a column after checking the pixel option of Resizable columns causes all the columns to shrink in the Document Edit view.
  • BUG-4775596 - Test Management - Can't add a new row in table fields on Test Cases document edit view
  • BUG-4775812 - Tracker Views - Sometimes AND/OR logic error message appears after selecting a private view
  • BUG-4775965 - Bug for "Check "Add new Member" option - "Invite new Users to Project by Email" tab": No error message when user already exists
  • BUG-4776076 - Mandatory IF - In the overlay that appear in the Document view doesn't display the red stars
  • BUG-4776220 - Test management - Success message is not consistent, if Test Set is created from Test Cases view's middle panel or Kanban
  • BUG-4776248 - Intelligent Document View - Level highlighter icon is disappearing when expanding a reference node in the tree
  • BUG-4777999 - Tracker item - Mandatory choice/Boolean type field is highlighted wrongly with missing value on doc. edit view
  • BUG-4778009 - Test Management - Getting "Wrong Test Run Id' error while uploading Run in Excel results, when tracker key contains a dash character
  • BUG-4780483 - Froala Editor - Duplicated item name on full screen overlay
  • BUG-4781875 - Intelligent document view central panel links are not valid in baseline mode
  • BUG-4783222 - Branching - Cannot select branch tracker in test coverage
  • BUG-4783548 - Mandatory if - Edit mandatory if overlay appears twice sometimes
  • BUG-4783815 - Post install - disabled option is pre-selected by default at database setup
  • BUG-4783860 - Mandatory if - Basic field validations messages should appear instead of mandatory fields are missing
  • BUG-4784034 - 404 error page appearing when try to change view of a tracker after setup filters
  • BUG-4784134 - Intelligent Document View - Auto expand not working on IDV
  • BUG-4784810 - Version badge is missing from cardboard view's items on baseline mode
  • BUG-4784835 - Intelligent Document View - Suspected badge is disappearing after page refresh
  • BUG-4786251 - Traceability - Role deletion is not working
  • BUG-4786295 - Test Steps are not displaying in Review Hub items once Test Steps is expanded
  • BUG-4787715 - CP Traceability Browser - cannot load saved presets
  • BUG-4787718 - CP Test Coverage - Uncaught SyntaxError: Unexpected token ';' after running the filter
  • BUG-4788393 - Traceability - Preset name can be overwritten with WRITE permission and error messages are not correct with READ / NO permission
  • BUG-4788397 - Mandatory IF - The activation value of the mandatory field disappears after multiple saves
  • BUG-4788406 - Tracker views - Cannot switch to Document View with active filtering when Document Edit View is the default layout
  • BUG-4788494 - Traceability - Error message is not correct in case of modifying the name of a preset to the name of another existing preset
  • BUG-4788610 - Post Install - post install process cannot be restarted when license is generated
  • BUG-4788634 - Bulk-Update Performance Degraded after 2020-09-28
  • BUG-4788741 - Tracker views - Saved intelligent view is lost after page refresh
  • BUG-4788751 - Baseline - Under baseline, associations shows invalid version numbers (baseline id)
  • BUG-4788759 - Tracker views - Set View as Default option does not work
  • BUG-4788779 - Traceability - Preset can not be opened from Load/Manage presets
  • BUG-4788794 - Test Management - Actual result is not editable after clicking on another custom field in Test runner
  • BUG-4789055 - Mandatory if - Document edit view right panel - the trigger input field disappears when mandatory if fields are missing
  • BUG-4789058 - Traceability - JS error while disabling IDV
  • BUG-4790560 - Tracker View - Trackers where table view is the default are not loads - error
  • BUG-4791023 - Excel import - not every item will be imported if user presses the Finish button too quick on Preview page
  • BUG-4791073 - Froala Editor - Uncaught TypeError: Cannot read property 'COMMANDS' of undefined
  • BUG-4791089 - Kanban View - Item is not visible in every state
  • BUG-4791097 - Test management - Suspended Test Run cannot be Resumed
  • BUG-4791293 - Tracker views - It is possible to use Intelligent view with Group by
  • BUG-4791538 - Excel Import - only 9996 items are importable
  • BUG-4791566 - Traceability - Roles remain ticked in Permissions drop-down when they are deleted
  • BUG-4791567 - XSS - Vulnerability while renaming menu items
  • BUG-4791688 - Project administration - Renaming tabs in top menu does not work when enter is use to register change
  • BUG-4791813 - Bug for "Ability to show Shared Field in Report and View screens - Reports page" - Invalid excel export shared field columns
  • BUG-4793318 - JS error - Unexpected token ',' after clicking on plus icon
  • BUG-4793660 - Project browser - Switching off a category, only activated after save
  • BUG-4793784 - Mandatory if - Error message is not user friendly when clicking Save without setting mandatory values in mandatory field editor (suspected merge overlay)
  • BUG-4794312 - Wiki Link/Url Field - fields do not work at all in Document Edit View
  • BUG-4795287 - Document Edit View - Moving columns by one not working
  • BUG-4795305 - Tracker views - Panel view is active even If I uncheck it
  • BUG-4795307 - Service Desk - opening existing item cause Console error Cannot read property 'hasOwnProperty' of undefined
  • BUG-4795538 - Tracker views - levels are lost in the Traceability tree when switching between intelligent views and Traceability browser
  • BUG-4805002 - Reported bug of a regression test case cannot be opened
  • BUG-4805640 - System Admin - despite of the different value, the Password Reset email says that email valid for 24 hrs
  • BUG-4806018 - Document Edit View - Column added with zero width when Resizable Columns set to Pixels
  • BUG-4806178 - Wiki - "Knowledge Base" link on Document View page redirects to wrong page
  • BUG-4806343 - JIRA Authentication - Missing error messages
  • BUG-4806352 - LDAP - Saving isn't possible, because the Synchronize users from LDAP/Active Directory section is empty, but the checkbox is not selected
  • BUG-4806389 - Table view - the position of the editor bar can be broken
  • BUG-4808235 - Document View - Couldn't load issue properties
  • BUG-4808442 - Table gets lost its choice reference type value(s) after suspected association merge
  • BUG-4808485 - Permanent Links - NullPointerException after click on permanent link from traceability browser
  • BUG-4809078 - Mandatory IF - A console error appears after saving if the Edit Mandatory IF overlay contains a field of type wiki text
  • BUG-4809122 - Tracker View Widget - Table view - Columns missing from saved view
  • BUG-4809123 - Traceability - Tooltip message reflects to View instead of Preset
  • BUG-4809482 - mxGraph - Wiki page - Korean characters are not visible in Froala editor
  • BUG-4809566 - Test Management - Mandatory field value check is missing from document view test steps
  • BUG-4809570 - Test Management - Mandatory IF field value check and red star is missing from document view test steps
  • BUG-4809662 - Tracker VIew Widget - Preferences - Show Descendant Items not works
  • BUG-4809683 - Performance problem if an item has more than 10000 child items
  • BUG-4809704 - Tracker views - Switching between Intelligent views and Traceability cause unsaved view and preset
  • BUG-4809707 - Baseline - Wiki generated version badge contains baseline id
  • BUG-4811318 - Computed field hiearachy doesn't work properly
  • BUG-4811781 - Tags with Korean characters are escaped on the Tags popup
  • BUG-4811956 - Test Management - Suspended status not visible in Test Run result table
  • BUG-4812315 - Workflows - If a mandatory field is missing during quick transition no editor appears
  • BUG-4812445 - Tracker views - Item count does not match If I use paging and Show All and after I select All items in a grouped Table view
  • BUG-4812610 - Tracker views - Selection (under the action bar) left there and did not disappear after when I use Move to option
  • BUG-4812657 - SQL Exception occurs using Shared fields with suspected
  • BUG-4812932 - Service Desk - hint message doesn't appear
  • BUG-4812941 - XSS - Vulnerability while changing summary of a field in Table View with inline edit
  • BUG-4814836 - Tracker View Widget - Planner - View does not load back properly
  • BUG-4814839 - Traceability browser not loaded when a project does not have Work Item Tracker
  • BUG-4815003 - Coverage Browser - filtering does not work (Go button has no effect)
  • BUG-4815004 - Tracker View Widget - After select a default member type on planner query not runs immediately
  • BUG-4815024 - Test Runner: Non image uploads are causing missing links in the generated bug
  • BUG-4815116 - Installation - cb service cannot be started on Windows - Failed creating java <cb>\jre\bin\server\jvm.dll
  • BUG-4815318 - Tracker Configuration - Console Error while trying to create new custom field with slow connection
  • BUG-4815328 - Test management - Updating a Test Run item not triggering the Distribution rules
  • BUG-4815461 - Test Management - "Completed at" field name on Test run item details page is wrong using German language
  • BUG-4815469 - Test Management - 'Test Step Result' field name on Test Run field configuration is wrong using German language
  • BUG-4815473 - Planner -The Spent effort dialog cannot be opened
  • BUG-4815582 - Picture uploaded into a Wiki text type column of a Table field is not rendered correctly
  • BUG-4815593 - Table view - 'status' is not read-only in history view
  • BUG-4817441 - Document view - Copy to/Move to function "Selected items" sub-function copy items recursively
  • BUG-4817445 - Planner View - Clicking on Go removes the added columns
  • BUG-4817493 - Cardboard - Items with 'Release/Sprint End Date' filter are editable
  • BUG-4820656 - Report - Group by Shared duration field is not possible, gives NullPointerException
  • BUG-4822186 - Document Edit View - Column context menu does not open after move
  • BUG-4822206 - XSS - Vulnerability while adding custom db performance job
  • BUG-4822393 - DB upgrade script is failing during upgrade of clone-saas.codebeamer.com
  • BUG-4822440 - Project Member Invitation via email - Invitation email is not sent
  • BUG-4822463 - Document View - A too long filter can hide the GO button under the right pane
  • BUG-4825551 - Database - changing lob Repetition parameter has no visible effect on db perf job results
  • BUG-4825552 - System Administration - Clicking on Show All on db results page closes the detailed results area
  • BUG-4832048 - Tracker Views - After view change on Kanban Board and change to Table View not load back fully
  • BUG-4832119 - Mandatory IF - The error message doesn't appears in the wiki link type field in the add new row overlay
  • BUG-4832259 - Reports - Can't overwrite report from context menu - Save as...
  • BUG-4836360 - Traceability Preset migration - If the level contains more than 1 tracker in the field settings Summary appears more than once
  • BUG-4836375 - Risk management - console error after template inserting and no inherite template configuration
  • BUG-4836389 - Test Management - Multiple test step edit focus during test step editing on document view
  • BUG-4836421 - Getting Release Items Fails
  • BUG-4836472 - Test Management - Bug report from test run - Test Steps are not in collapse boxes
  • BUG-4836546 - PDF export - no email notification arrives about PDF export
  • BUG-4836574 - User Interface - Icons are not displayed in Risk Matrix Diagram
  • BUG-4836758 - Intelligent Document View - Highlighting not working on newly expanded items
  • BUG-4836772 - Wiki Plugins - My Reviews widget paging is not working, "page" Failed to convert property value of type java.lang.String[]
  • BUG-4837489 - Tracker views - Save button does not work in Intelligent View Configuration modal
  • BUG-4837500 - Traceability preset migration -Some usability problem if I use checkboxes in the Preset
  • BUG-4837925 - Not possible to save the values of a table field in Item/Document/Table views
  • BUG-4840456 - Tracker Views - On table view if resizable columns and show children are on, I cannot open child nodes
  • BUG-4840464 - Tracker Views - resizable columns are not saved with tracker views
  • BUG-4840559 - Tracker Configuration - Checkboxes are disabled in general tab
  • BUG-4840611 - Branching - Imported project does not have sub branch in tracker tree
  • BUG-4840832 - Bug for "Show parent-child hierarchies using Intelligent Document View with predefined Traceability" - Traceability limit warning message is broken
  • BUG-4840878 - User Interface - Custom tracker icon is not displayed on Configuration Diagram
  • BUG-4840888 - Excel Import - Cannot import Test Cases to Test Sets when importing from excel file
  • BUG-4840930 - Bug for "Show parent-child hierarchies using Intelligent Document View with predefined Traceability" - Office export is broken
  • BUG-4840991 - Post install - post install process terminates in case of new user registration
  • BUG-4841471 - Document View - Recently created item's edit page loads in version 1 instead of head
  • BUG-4841730 - User Interface - Icons are not displayed correctly after custom tracker icon deletion
  • BUG-4841747 - Table View - Show children breaks resizable markers
  • BUG-4841774 - Account expiration does not work on SAAS
  • BUG-4841775 - Email invitation - opening invitation link the login page loads (404.jsp)
  • BUG-4841831 - Dropdown list is behind dialogue in report editor
  • BUG-4843659 - Intelligent Document View - Level badge missing after refreshing the IDV
  • BUG-4844935 - Remote Issue Reporting doesn't work or missing some configuration
  • BUG-4844936 - After project export large temp files are created but not removed to free up disk space
  • BUG-4845177 - Tracker Views - Checking on off Panel view ignores the active filters
  • BUG-4845315 - Intelligent Document View - Right panel is not refreshing when selecting the same reference item with different versions under initial nodes
  • BUG-4845371 - User Interface - In Table view sticky header does not stick up in case Traceability Tree View
  • BUG-4848624 - User Interface - Icon size is not correct in Traceability section
  • BUG-4848705 - Permanent Links - Checking an already deleted Traceability Browser link causes error
  • BUG-4848767 - Dashboard - My Current Work Items widget not working in new installed codeBeamer
  • BUG-4848768 - HTML code content is displayed in Traceability Section of the Item details page
  • BUG-4850458 - Test Run Created in Wrong Tracker
  • BUG-4851084 - Intelligent Document View performance test is slow
  • BUG-4851325 - Coverage Browser pages are slow performance test
  • BUG-4851371 - Test Coverage pages are slow performance tests
  • BUG-994121 - Project Browser - Working sets - creation of working sets with same name is possible, which leads to strange behaviour of affected working sets
  • BUG-2932755 - Cannot print merge field values of exported Word documents
  • BUG-3779934 - Add a comment with uploaded file via "Add Comment/Attachment" in the context menu gives "java.lang.NullPointerException"
  • BUG-3906935 - Adding a missing parameter to fields in in-place edit aren't appearing in the test parameters
  • BUG-4093075 - I can not add email connection to Main Inbox, I get AUTHENTICATIONFAILED message
  • BUG-4185330 - SQL clear_bits out of range Error Message when selecting a template for a tracker
  • BUG-4226225 - "permission.issue_attachment_add.label" appears in Tracker configuration Audit Trail/Permissions tab
  • BUG-4275335 - Search does not work for certain users on cb.com
  • BUG-4305357 - Swagger API - Soft locks doesn't work
  • BUG-4311168 - Invalid number items under Overall Review Statistics in Review Hub view
  • BUG-4324369 - Storing / Changing Anonymous user is not cluster ready
  • BUG-4333427 - Documen tView: DnD issue from library to left tree while historical filter is active
  • BUG-4336839 - No indicator for file upload
  • BUG-4343139 - Mail "props" section is lost in new installs
  • BUG-4343817 - The Test Run specified "Test Cases" and "Test Step Results" fields are empty in Traceability Browser
  • BUG-4350996 - Associations - Drag&Drop Association in baseline in details page creates it in head revision
  • BUG-4358641 - Word export tests are broken on Windows
  • BUG-4368150 - Missing icon on Tracker Configuration Field tab
  • BUG-4373287 - The Export of new Empty project contains no checksum and an empty JSON
  • BUG-4374758 - Service Desk controller does not handle invalid parameters properly
  • BUG-4374815 - Service Desk - A letter is missing from hint message.
  • BUG-4375208 - Not understandable info message shown sometimes during exporting Traceability Browser
  • BUG-4375580 - Passed results are shown as Skipped after re-running test cases
  • BUG-4381815 - NullException while exporting
  • BUG-4383135 - Inherited tracker views (transition guards, workflow conditions) are not exported, when exporting a project as a template
  • BUG-4383171 - Several bugs in the embedded table GUI
  • BUG-4383215 - Status not changing to In Progress when starting the Test Run
  • BUG-4384172 - Test Management - Test run - Re-run Test Cases| Test Run with parametrized test cases starts not with the first parameter
  • BUG-4384300 - Word Export - export process ignores "reRunPeroid"
  • BUG-4385853 - Test Management-Test Runs-Baseline| Baseline of the Test Runs is empty
  • BUG-4386009 - Test Management - Test run - Inner Re-run - In case of test set with sequential=true, the inner re-run starts not with the first test case
  • BUG-4386044 - Test management - Test Run creation is not available with Test Lead role
  • BUG-4386256 - Test management - Inner Re-run - Selecting the "Re-run selected tests without creating new Test Run(s)" option with Test Engineer role, get an unexpected system error.
  • BUG-4386475 - Test management - The OK/Cancel are missing in Action/"Start a new review" icon in State Transitions tab
  • BUG-4386500 - Test Management- Workflow based review| On Exit makes no sense in case of review of a formal Test run
  • BUG-4386622 - Word Export in background - user is not notified if a Word Export file is available no more
  • BUG-4386760 - Risk Matrix Diagram - There are two Export to Excel/Word link
  • BUG-4389977 - Test management - Review - The info icon in approval dialog does not link to the Review knowledge
  • BUG-4390225 - Test management - Inner re-run - In case of assign the test run to a user with tester role during inner re-run creation, I get unexpected error in running dialog
  • BUG-4392428 - Risk Matrix Diagram - Change the label name in the overlay if I check on Show Mitigation Requirements
  • BUG-4392566 - [Branch Test] Migration script does not handle COMPLETED status
  • BUG-4392568 - [Branch Test] Generated test run has no name
  • BUG-4392979 - Risk Matrix Diagram - Only the causing work items diagrams are exported to Excel and word export file is empty
  • BUG-4392993 - Error appears when switching to Doc View or to Doc Edit View while i have an active and valid AndOr Logic
  • BUG-4392995 - [Branch Test] Missing Test Case parameters remain unfilled
  • BUG-4393398 - Risk Matrix Diagram - Word export provides empty word document
  • BUG-4395717 - [Branch Test] Update Public views according to new workflow
  • BUG-4397160 - Document export - Not understandable error message appears/arrives in case of invalid CBql
  • BUG-4397174 - Callback URL check throws NPE
  • BUG-4397175 - Callback URL check does not work with self signed certificate
  • BUG-4397277 - Document Export - Error after exporting with a user who has no Item Export permission for a tracker that is part of the export
  • BUG-4401863 - [Branch Test] Test Lead has no permission for Ready for execution state
  • BUG-4402118 - Document export - User is able to export to export items from a project where he/she has no permission (even not a member of the project)
  • BUG-4402606 - Test Management - Inner re-run - The test case run status is null while the quick test run status is In progress
  • BUG-4406604 - Test management - Formal test run / Inner re-run - In case of start a review in Finished status, and the Reject action sets In progress status, selecting the inner re-run option gives unexpected error
  • BUG-4406659 - Test management - Formal test run - In case of set a review to Finished status, the Review option appears in test case run child item
  • BUG-4406807 - Test management - Test Run - Kanban Board View option only appears in item details page
  • BUG-4407096 - Cannot use Word Export via REST on the test server.
  • BUG-4409957 - Reference selector overlay - Show Ancestor Items and Show Descendant items options are not working in case of single fields
  • BUG-4410217 - Document export - invalid hyperlink on help icon at configuration item overlay
  • BUG-4410578 - Test Management - Test Run - If I copy a Regular Test Run the copied item status is To be approved
  • BUG-4410586 - Document export - Items at the Word export file has different heading despite of that they are at the same level
  • BUG-4410644 - Word export - A docx file download that i am not able to open in case of using docm template to export
  • BUG-4410678 - Document export - User is not alerted that there are more items than exported on a level but reached configured limit
  • BUG-4412316 - [Branch Test] Risk migration script does not take into account old templates where the choiceList[2] means something else
  • BUG-4412317 - Document export - not human readable error appears in case of no permission for a called report
  • BUG-4412364 - Console error when opening a report in View Mode
  • BUG-4416868 - Test Management - Review - If there is a Review to Finished status, after Run in Excel there is no Review option
  • BUG-4426129 - Test management - Custom fields saving problems when editing test cases in item details view
  • BUG-4426149 - Test management - Hidden custom fields are visible when editing test cases in item details view
  • BUG-4426173 - Test management - Given values are not visible on custom fields read mode when editing test cases in item details view
  • BUG-4426271 - Test Cases Document View | Numbering is misaligned from Summary on center panel
  • BUG-4426274 - Test management - Wiki text type custom field is filled with source code when editing test cases in item details mode
  • BUG-4426475 - Document export - Export fails with a specific template if user has no Tracker View permission
  • BUG-4426942 - Test Management - Custom fields - I can add value to the custom field which is not in allowed values
  • BUG-4427020 - Test Management - Custom fields - In Running dialog the number of the steps and the passed/failed icons are slid on each other
  • BUG-4427107 - Test Management - Custom fields - If I inner re-run or re-run a test run the images are not appeared
  • BUG-4427109 - Test Management - Custom fields - I cannot add steps in Document Edit View if I create new test case
  • BUG-4427165 - Test Management - Custom fields - If I edit item in Document Edit View using status modification icon, the step values are not appeared, the Boolean type seems false
  • BUG-4427294 - Test Management - Custom fields - The images, links, files and tables are not appeared well in Test Run, Details of Test Results section
  • BUG-4427306 - Test management - When editing custom test steps, table buttons does not work
  • BUG-4428031 - Test Management - Picture is not shown in Wiki text type custom field on Document View
  • BUG-4428267 - Test Management - Duration type custom field changes value itself, after editing/saving the Test Case
  • BUG-4428361 - Test Management - Custom fields - If I add a parameter, it does not appear in the running dialog
  • BUG-4428403 - Test management - Test steps will disappear if I edit then save a test case on item details page
  • BUG-4430526 - Test Management - Failed to load resource: the server responded with a status of 404 from editTestStep.js appears when execute a test run
  • BUG-4430602 - Test Management - Non admin user can edit custom fields on Document View
  • BUG-4430642 - Document view - Editing test steps does not put focus on first action
  • BUG-4431959 - Document View - Cannot open Test steps of Accepted Test case
  • BUG-4431982 - Document view - Cannot add new Test step to new Test case
  • BUG-4432024 - Test management - Custom fields - Today/Yesterday Date format is not consistent
  • BUG-4432026 - Test management - Custom fields - In Run in Excel, the date is not the added one
  • BUG-4432073 - Test management - error occurred when filling duration field with invalid value
  • BUG-4432112 - Test management - Missing test step action message is not informative
  • BUG-4432166 - Test management - Can not drag and drop test steps to test case
  • BUG-4432452 - Test management - UI validations does not work for custom fields
  • BUG-4432879 - Test management - Custom fields - In a new Test Cases tracker after create an item in Document Edit view, the modification gives error in the right panel
  • BUG-4435460 - Test Management - Cannot navigate with tab on Document View center panel in edit mode
  • BUG-4435580 - Test management - If Column permission is enabled in Test steps table, action and expected result fields changes are not saved.
  • BUG-4435816 - Test Management - Custom fields - The choice field options are connected to each other with id - the values could be different
  • BUG-4435822 - Test management - Choice field (single select) editing problems on item details view.
  • BUG-4435915 - Test management - Custom field - In item details page edit mode the custom fields are not editable after clicking in it
  • BUG-4435957 - Test management - Some fields mandatory check does not work on table "edit row/create row" dialog
  • BUG-4435958 - genericWikipage section is not exported as a template
  • BUG-4436334 - Test Management - Unexpected error when generating Test Run from a Test Case with mandatory custom field
  • BUG-4441751 - Test Management - Custom steps - The added custom field value is not saved in running dialog if the field is only added in Test Run tracker
  • BUG-4447636 - Sql syntax error in TestManagementDao.xml
  • BUG-4447819 - Test Management - The mandatory field is empty message appears if I generate a test run with added mandatory field value
  • BUG-4448250 - Test Management - Hide If fields are visible even when hide If condition is fulfilled
  • BUG-4449905 - Word Export - Exporting to PDF fails
  • BUG-4452096 - Tracker view widget - Re-Save a tracker view, drops the previously configured permissions
  • BUG-4452131 - Test Management - Field dependencies does not work on Custom test steps
  • BUG-4453904 - Test Management - Test Case cannot be saved with mandatory field, additional empty test step created
  • BUG-4455226 - Test Management - After copy a test step with image, invalid link is appear
  • BUG-4457895 - Test Management - After copy a test step reference information is visible
  • BUG-4457896 - Test management - If I create a new test cases item in item details page, the item cannot saved.
  • BUG-4458201 - Test Management - Custom fields are not visible on Test Run page under Details of Test Results section
  • BUG-4458556 - Test management - Custom fields - In running dialog there is a plus scrollbar
  • BUG-4458718 - Installation - Stop script does not stop the codeBeamer server completely
  • BUG-4458756 - Test Management - Custom fields - If there is a wikitext type custom test step field in Test run, the special values are not appeared
  • BUG-4460380 - Test management Run-in Excel - Color type field can be imported with invalid value
  • BUG-4460384 - NPE during automatic OpenID logging
  • BUG-4460395 - The character ">" does not rendered correctly in Test parameter names
  • BUG-4460702 - Test Management Run in Excel - There are no error/warning message after uploading excel file with empty mandatory fields
  • BUG-4461380 - Test management - Custom fields - The text in wikiText type field in edit mode is right aligned, the other fields are left aligned
  • BUG-4461381 - Test management - Custom fields - In Inner Re-run the parameters which come from a test set do not appear
  • BUG-4467501 - Test management - Custom fields - If I add value to a custom field in the running dialog and click on "Pass Step" the actual result is empty
  • BUG-4472408 - Test management - Custom fields - In item details page edit mode the image does not appear
  • BUG-4472555 - Test management - Custom field - If I open a link in running dialog and close the dialog, after there are an invalid links in the running dialog
  • BUG-4472608 - ReqIF Import Fails if Repository-ID is inconsistent.
  • BUG-4472609 - Problem with statuses of folder/information type items
  • BUG-4472655 - Test management - Custom fields - In running dialog the added empty parameter does not appear, only in Using parameters section
  • BUG-4472661 - [XSS] Bug report from test run
  • BUG-4472751 - [XSS] Test run custom field
  • BUG-4472796 - Test management - Custom fields - In test case item details page if I add a new step with custom field values and delete the row, I get an error page after clicking on Cancel
  • BUG-4475857 - Test Management - HTML code appears on report bug from running dialog
  • BUG-4475981 - Test management - Custom fields - There is an error message: "State transition "Design" is not applicable for [tc4-null] in status "--" " in item details page after set transition and step in Test Cases tracker Document Edit View
  • BUG-4476139 - Test Management - Word Export - Custom field - JSON error when trying to export custom Country type field at Test Step table (both Test Case and Test Run)
  • BUG-4478008 - Test Management - Custom fields - In the running dialog the editable Members field's frame is wrong
  • BUG-4478270 - Bugs in TestCase's step editor with custom step columns
  • BUG-4478323 - Test Management - The integer, decimal type custom fields gets 0 value in Run in Excel
  • BUG-4481264 - Test management - The formality values do not appear in Traceability browser
  • BUG-4481266 - Test management - Reports - I cannot add Formality column to the report
  • BUG-4481269 - Document export - Document export not working
  • BUG-4485221 - Test management - Item details screen action and expected result field falls apart when navigating into a custom field
  • BUG-4485280 - Test Management - Parameter value is not set in text type custom field
  • BUG-4485308 - Document export - Versions are not checked on traceability queries without historical filtering i
  • BUG-4485556 - Test management - Test Cases Document View - The original step fields are not editable
  • BUG-4485595 - Test Management - Run in Excel inner-rerun - Results are ignored after uploading excel file
  • BUG-4485798 - Test Management - Error message contains additional <br/> in Test Runner window
  • BUG-4485817 - Test Run workflow upgrade problems on MTS
  • BUG-4487576 - Test management - Test cases - In item details page the "Add Steps!" button does not work
  • BUG-4487873 - Test management - Test case Excel import - There is technical error message during import
  • BUG-4488028 - Test Management - Editing custom fields not working properly on Test Case edit page
  • BUG-4488095 - Test Management - Unexpected system error when trying to add Test Case to Test Set from a different project
  • BUG-4488143 - Test Management - Some Field values disappears when editing a row on Document Edit view
  • BUG-4489366 - Test management - The duration value does not appear well in excel export
  • BUG-4489372 - Test management - The choice - option custom test step field value does not appear well in excel export
  • BUG-4489454 - Word export - 404 response at console for help.png when clicking on Export to Office option from a tracker
  • BUG-4489558 - Test management - Test run - In inner re-run the added value in wiki text field is not appeared in details page, if I select Pass step after added value
  • BUG-4489844 - Test Management - Custom choice field values are not transferred after generating Test Run from a Test Case
  • BUG-4491532 - Test Management - Field permissions are applied on Test Runner although the column permissions checkbox is unchecked
  • BUG-4491575 - Test management - Custom fields - If there is a referring item to the step, the custom test step fields are not refreshed
  • BUG-4491576 - Word Export - when only Expand option is enabled supported items are also listed via links
  • BUG-4491716 - Document Export - limitByPreviousLevel is not working
  • BUG-4491780 - Test Management - Test step reuse as a reference - Warning message not shown correctly on edit page
  • BUG-4493274 - Static Field Dependencies - Option Any not working
  • BUG-4493575 - Document Export - Limit-1 item exported
  • BUG-4493691 - Document export - item, that has no level 1 item not part of the export in case of table rendering
  • BUG-4493739 - Test Management - Referring information is missing from center panel on Document View when Test Case has a reused Test Step
  • BUG-4494031 - Test Management - Test step reuse - Editable/read only check is not working properly when reusing a Test Step with different custom fields
  • BUG-4494034 - Test Management - Test Step reuse - Lost fields information is displayed out of editing mode
  • BUG-4494066 - Document Export - not every item exported
  • BUG-4497846 - Test Management - Editable checkbox is not copied to new tracker when using tracker inheritance
  • BUG-4498133 - Test Management - Test runs - Missing/empty sections from test run page
  • BUG-4498189 - Test management - Warning messages in log files after clone.codebeamer upgrade
  • BUG-4499569 - Test Management - Test step reuse - Link is not working when editing Test Case and reusing a test step as a reference
  • BUG-4499854 - Test management - Cannot make inner re-run, I get error message
  • BUG-4499855 - Test Management - Content is disappearing from Wiki text type custom field
  • BUG-4499875 - Test management - Test Runs items appear in Test Cases tracker
  • BUG-4499976 - Traceability returns arbitrary versions for an item if historical filtering is enabled
  • BUG-4500112 - Test Management - Test step reuse - Exception when "cross-reusing" steps from two test cases
  • BUG-4500163 - Test management - Test cases - Only one step appears in Add steps section if there are more steps with same values
  • BUG-4502564 - Test Management - Navigating with Tab from last Test Step field navigates to Critical checkbox of new step instead of Action field
  • BUG-4505787 - Test Management - No error message on Document View if only Expected Result is filled of a test step
  • BUG-4505788 - Test Management - Custom field value is not changing after editing it in runner window
  • BUG-4506342 - Test management - Custom fields - In test case details page edit mode if I click on a choice field, the second row appears
  • BUG-4506498 - Duplicate functionality does not work
  • BUG-4506832 - Test management - custom cell values are not rendered correctly when there is a blank test step
  • BUG-4507009 - Test management - Custom fields - The date custom test step field value is different after saving
  • BUG-4507020 - Test management - Custom fields - If I insert a new row, the custom field values are disappeared
  • BUG-4508127 - Project Configuration Merge - MySQLIntegrityConstraintViolationException during merge process
  • BUG-4511699 - Test management - Custom fields - If I reuse a step and click in the first step which is not reused, the values are copied to the reused ones
  • BUG-4511739 - Test Management - 404 error after cancel of quick transition change
  • BUG-4512289 - Test management - Custom fields -In item details page the added custom field values are not appeared during editing
  • BUG-4512440 - Document Export - There are no differences between versioned and not version items at export file
  • BUG-4513728 - Test management - Custom fields - If I navigate with tab during step editing in item details page or in Document View, it does not work well if there is a computed field
  • BUG-4515687 - Test management - I cannot make test run in new project with default template or created from demo project
  • BUG-4518500 - Document Export - Historical filtering is not working when trying to search version by date
  • BUG-4520800 - Test Management - Test Case with empty Action field can be saved when only custom field is filled
  • BUG-4522983 - Test Management - MTS is broken after deploy

Tasks

  • CTSK-1750951 - Upgrade MySQL 5.7 to 8.x
  • CTSK-2209973 - Implementation of ability to Filter for groups in "AssignedTo" field
  • CTSK-2393237 - Refactor Interactive section of Config
  • CTSK-2657676 - Provide Initial release for PostgreSQL support
  • CTSK-2657683 - Post Installation support for PostgreSQL
  • CTSK-3031801 - As a user I want to see All items, Assigned to and Submitted by information on my wiki page
  • CTSK-3273961 - Traceability Preset migration to new version
  • CTSK-3651476 - Using Shift-Ctrl-V in Froala editor would support paste as Text implicitly
  • CTSK-3714707 - Replace Scrum Template in codeBeamer Distribution
  • CTSK-3746782 - As a developer I want to render Math formulas by JS
  • CTSK-376007 - Same validation messages on Service Desk form, as on Create tracker item page
  • CTSK-3921307 - Swagger API - Create a /v3/users/search endpoint
  • CTSK-3973683 - Improve security for Edit via Office plugin
  • CTSK-4011488 - Upgrade froala editor and remove the workaround for a bug
  • CTSK-4011491 - Refactor item Link and wiki Link tags
  • CTSK-4026510 - Doc export - Support merged table cells
  • CTSK-4033709 - As a system administrator I want the application configuration to be rendered with wider indentation
  • CTSK-4105447 - Traceability Preset migration to new version - Part 2
  • CTSK-4141872 - Drop Derby support
  • CTSK-4142060 - Resolve order of SAML SSO user should be configurable
  • CTSK-4176744 - Edit Work Item Summary and Description Table View using Inplace editor
  • CTSK-4176757 - Select panel view mode between bottom, horizontal and right, vertical modes
  • CTSK-4176798 - Add comments using Horizontal details panel mode
  • CTSK-4176876 - Store existing Table View configuration into a View and Shared link
  • CTSK-4219578 - Traceability Preset migration to new version - Part 3
  • CTSK-4226892 - Project Category Hierarchy should be loaded by type id instead of name
  • CTSK-4230462 - Make SAML configuration user friendly
  • CTSK-4236136 - Change logging level for some file handling methods
  • CTSK-4258621 - Update Work Item details Traceability to the newest version to make functionality align with showing deleted tracker items in a project baseline causes invalid traceability view on item view.
  • CTSK-4275343 - Blob type data should be moved into one table
  • CTSK-4275357 - Set timeout for starting external git command
  • CTSK-4322470 - Email address of the user should be marked as invalid if it is bounced back from AWS SES
  • CTSK-4322978 - Callback url of word export should be configurable via environment variables
  • CTSK-4351025 - Intelligent Document View refactor
  • CTSK-4352539 - Add credits.html into codeBeamer
  • CTSK-4364985 - Jira Basic Auth is deprecated
  • CTSK-4367316 - RPE Report does not use head version of report when version was not provided.
  • CTSK-4375230 - Unclear Order of State Transition Actions
  • CTSK-4375231 - Automatic state transition is not triggered, if the from-state is entered from en escalation.
  • CTSK-4383144 - Enhance TrackerItemManager.copy() to be also used in the context of an enclosing multi tracker batch operation
  • CTSK-4390974 - CC sysadmins to document export error emails
  • CTSK-4391083 - Unmeaningful warning / intelligent document view / office export
  • CTSK-4411797 - Show Url and Artifact Associations on Document View panel without user Traceability
  • CTSK-4412027 - Allow tracker locking only for Tracker Administrators
  • CTSK-4423550 - Update the cB version handling logic to support release code names
  • CTSK-4426054 - Automatically generate credits.html as part of the build
  • CTSK-4429034 - Implement outline ordering feature into cbQL
  • CTSK-4434927 - Remove MariaDB support
  • CTSK-4441567 - Refactor email sending
  • CTSK-4441837 - SAML based configuration should be reloaded without restart
  • CTSK-4447854 - OpenID configuration must be reloaded in runtime
  • CTSK-4447860 - Login page should not be available for users in case of automatic option is set for SAML and OpenID
  • CTSK-4449895 - Usability of URL/File link selector improvements, to be able to select Baseline or static version of reference
  • CTSK-4449896 - Ability to enter static URL or static markup in Wiki/Link selector
  • CTSK-4453603 - Modify the Excel import process UI interface to call Microservices after successful configuration
  • CTSK-4453905 - Add the possibility to be able to configure the Registration activation and Password email expiration delay times
  • CTSK-4460609 - Change document view cbQL limit
  • CTSK-4460645 - Remove document view cbQL count limitation in 10.1 patch
  • CTSK-4468624 - Admin should be able to test OpenID authentication without saving the configuration
  • CTSK-4471906 - Add cache for recent values feature
  • CTSK-4471908 - Improve caching of user photos
  • CTSK-4471924 - Improve caching for user licences
  • CTSK-4480777 - Send Tracker Outline Structure information for each Work Item through reports into RPE Word Export
  • CTSK-4480831 - LDAP login can be enabled / disabled from environment variable
  • CTSK-4481049 - Implement backend extension of Share backend logic for personal usage on different Views
  • CTSK-4481061 - Implementation of changing existing View and Default View logic to support new Share based Table View rendering
  • CTSK-4481064 - Implementation of usage of Report engine with Share logic to improve usability of view settings
  • CTSK-4481077 - Implementation of Using quick transitions within the table view should not jump to the top of the page
  • CTSK-4481079 - Implementation of Mark previously selected or opened Work Items in different Views
  • CTSK-4481243 - Keep DB update scripts in a separate directory named by the release
  • CTSK-4481494 - Implement Tracker configuration support of Mandatory If feature
  • CTSK-4481566 - Implement In place edit support after changing a Work Item on Various Views
  • CTSK-4481570 - Implement Work Item details page automatic refresh when field mandatory status changes
  • CTSK-4481577 - Implement Tracker Template Support of Tracker configuration for Mandatory If feature
  • CTSK-4481580 - Implement Test Runner screen for "Mandatory if" and "Hide if" regulations
  • CTSK-4481581 - Implement Test Run generator screen for mandatory If regulations
  • CTSK-4481584 - Implement Mandatory If Mass Edit support
  • CTSK-4481585 - Implement Mandatory If check when saving a work item
  • CTSK-4481586 - Implement Mandatory If check during Workflow Transition actions
  • CTSK-4481590 - Implement Project Export import support using Mandatory If
  • CTSK-4481648 - Implement Suspected field merge support using Mandatory If
  • CTSK-4481661 - Implement Word and Excel import for Mandatory If support
  • CTSK-4481662 - Implement of Run in Excel feature for mandatory If regulations
  • CTSK-4481666 - Implement Do not allow Mandatory If for Trackers with Doors or Jira integration
  • CTSK-4481668 - Implement Escalation support using Mandatory If
  • CTSK-4481669 - Implement Swagger and Rest API support using Mandatory If
  • CTSK-4481670 - Implement Project Deployment support using Mandatory If
  • CTSK-4481671 - Implement Work Item details and Inplace editor Table field handling using Mandatory if
  • CTSK-4491621 - Update RPE Templates according the new Report result using Tracker Outline Schema
  • CTSK-4499835 - Add floating buttons for activating Panel View
  • CTSK-4505886 - Implement the possibility to set Customization of Header and Footer for exported Excel documents
  • CTSK-4506120 - Implement the creation of Test Cases from Test Set Edit View
  • CTSK-4506130 - Implementation of Set Parent during Move To operation
  • CTSK-4506142 - Implementation of Has Association and Association cbQL Report options
  • CTSK-4506144 - User Interface support of Has Association and Association onto Report and Test Coverage screens
  • CTSK-4506220 - Implementation of Individual Tracker Work Item icon
  • CTSK-4506225 - Implementation support Individual Tracker Work Item icon export / import and Tracker Templates
  • CTSK-4506276 - Implement to show table header in report editor using sticky header
  • CTSK-4506282 - Implement the ability to trigger workflow transitions on Intelligent Table View
  • CTSK-4506801 - Replace jTidy 3rd party with Jsoup 3rd party
  • CTSK-4512101 - Limit number of items on a level on document view
  • CTSK-4534004 - Do not load data of "Create Downstream Reference" on page load
  • CTSK-4535318 - Ability to switch off all custom codes from codeBeamer
  • CTSK-4535388 - Email templates can be overwritten from external repository
  • CTSK-4535413 - Custom logo should be stored under the /repository/config/logo directory
  • CTSK-4535476 - Add MaxJavaStackTraceDepth to JVM option in docker
  • CTSK-4535558 - Remove support for Excel files before Office 2013
  • CTSK-4535723 - Change text of SSO button
  • CTSK-4536030 - Show execution time of iSQL queries
  • CTSK-4536112 - Exception upon closing release because of two history entry with same revision by Doors Bridge
  • CTSK-4548090 - Slow SQL statements during import over Swagger API
  • CTSK-4565687 - Tracker cardboard loads all tracker items
  • CTSK-4571576 - Avoid repeating requests on Report editor
  • CTSK-4571983 - Create database performance test
  • CTSK-4584677 - Localisation of codeBeamer should be configurable from external properties
  • CTSK-4584697 - Log out SQL with parameters when slow sql is detected
  • CTSK-4584701 - System administrator should be able to override cache settings from external file
  • CTSK-4603049 - Fix logging for OpenId failed authentication
  • CTSK-4606248 - Implementation of filtering of alpha-numeric text-fields by the following comparison-operators >,<,>=,<=
  • CTSK-4606336 - Backend Implementation of filtering of alpha-numeric text-fields by the following comparison-operators >,<,>=,<=
  • CTSK-4606981 - Implement Mandatory If check during Cardboard, Planner and Document View actions
  • CTSK-4610977 - Implement Mandatory If check during Document Edit editing
  • CTSK-4613026 - Support repositioning items on root-level
  • CTSK-4621825 - Swagger API - Return all members for a project
  • CTSK-4621829 - Swagger API - Get fields for an item in custom field format
  • CTSK-4621831 - Swagger API - Extend /items/query to accept baselineId
  • CTSK-4621838 - Swagger API - Get all baselines for a tracker
  • CTSK-4625932 - Remove nohup.log from docker environment
  • CTSK-4625933 - Hide "Next full indexing" information if full-indexing is turned off
  • CTSK-4628954 - Fix Subquery returns more than 1 row issue while indexing
  • CTSK-4635436 - Synchronize LDAP Users
  • CTSK-4638900 - User should be able to sign reviews / documents without password
  • CTSK-4647574 - Swagger API - Return all members for a group
  • CTSK-4654061 - Change "Start a review" limitation from Status ID to a better one
  • CTSK-4658090 - Workflow action should be added as a jar to the docker image
  • CTSK-4660589 - Create db statistics analyse job only for Oracle database
  • CTSK-4671191 - Swagger / Legacy APIs should not work with user / password in case OAuth authentication is available
  • CTSK-4683238 - Support Resizable Columns and Panel View settings when we store User session settings
  • CTSK-4683255 - Support CTRL+S on appearing mandatory field editor infter inplace editing a field
  • CTSK-4683390 - Replace the text and filter condition input areas on Text type field
  • CTSK-4684927 - Add Traceability Preset edit option
  • CTSK-4687030 - Jira accounts must be processed as case insensitive
  • CTSK-4687031 - Doors accounts must be processed as case insensitive
  • CTSK-4693048 - Extend existing /v3/testruns/{testRunId} endpoint to support custom fields
  • CTSK-4699433 - Use Microsoft Word to convert docx to PDF
  • CTSK-4717546 - Reorganize layout of View manager overlay
  • CTSK-4723350 - Enable Search in Work Item Ids option by default
  • CTSK-4723352 - Upgrade Tomcat to the latest version of 8.5.x
  • CTSK-4770756 - Make PDF generation disable on UI if no PDF export tool is configured by the system admin
  • CTSK-4771568 - DB performance monitoring: notices and additional features
  • CTSK-4775597 - Replace oracle12 dependencies
  • CTSK-4776037 - Add GATHER_STATS_LOG content to perf monitoring
  • CTSK-4776272 - Swagger API - Filter user data based on group permissions
  • CTSK-4788491 - Turn off global excel header / footer feature
  • CTSK-4788638 - Remove temporary / mandatory Add New Test Case from Test Set feature
  • CTSK-4788746 - Ability to disable Page View storage and restore functionality.
  • CTSK-4788760 - Disable the editability of test steps on the Table and Document Edit views
  • CTSK-4791088 - Add limit to the my-current-issues-widget
  • CTSK-4791160 - Change cbQL result error messages
  • CTSK-4793231 - Remove the possibility of Project Configuration merge from User interface
  • CTSK-4811327 - Provide a warning message onto Calendar to inform users how that affects on business logic
  • CTSK-4848324 - Remove the limitation on the supported test step field types when importing from Excel
  • CTSK-2326400 - Risk Management Trace Direction change
  • CTSK-2679991 - Provide update script for Risk Trace Direction change
  • CTSK-2920989 - Data export - Improve Word Export data loading - do rendering iteratively instead of passes
  • CTSK-3921249 - Extend /v3/projects/{projectId}/trackers/search with keyName filtering
  • CTSK-3921307 - Swagger API - Create a /v3/users/search endpoint
  • CTSK-3921330 - Swagger API - Locking should be effective on API calls also
  • CTSK-4026182 - Doc export - Get CBQL queries from the template
  • CTSK-4026186 - Doc export - Extend the export tool to process CBQLs
  • CTSK-4026202 - Doc export - Support referencing item lists received from the UI
  • CTSK-4038196 - Doc export - additional export parameter handling
  • CTSK-4048408 - Doc export - Design template structure supporting queries
  • CTSK-4056921 - Swagger - Set lock for tracker items
  • CTSK-4056931 - Swagger - Release lock for tracker items
  • CTSK-4057584 - Swagger - Get lock information on tracker item
  • CTSK-4097175 - Add copy selected custom fields values to newly created Test Runs during Test Run generation process
  • CTSK-4097251 - Custom test steps on test case tracker item edit screen
  • CTSK-4097313 - UI for filling test step fields when running a test
  • CTSK-4097341 - Test Management- Run-in excel custom test step at the template export
  • CTSK-4097739 - Custom test steps on test case doc view
  • CTSK-4097747 - Custom test step fields for test run generated bug creation
  • CTSK-4097753 - Test Management - Run-in excel import with custom fields
  • CTSK-4106524 - Custom test steps on test case item details screen
  • CTSK-4106525 - Extend the existing test case Word export templates to include custom fields of test steps
  • CTSK-4106527 - Extend the existing test run Word export templates to include custom fields of test steps
  • CTSK-4142373 - Extend test run workflow with "To be approved" status
  • CTSK-4142599 - Add option for re-running a test case
  • CTSK-4171029 - Doc export - Support nested table rendering
  • CTSK-4185328 - Make the export generation run in the background
  • CTSK-4197653 - Swagger API - Traceability - Create smoke tests for generated client library
  • CTSK-4220162 - Create migration scripts from the old test run workflow to the new one
  • CTSK-4225771 - Extend the Formal test run workflow with Refused state
  • CTSK-4242009 - Custom SSL certification should be configurable for word export web application
  • CTSK-4264106 - Extend test run approval with workflow based review
  • CTSK-4264117 - Usability improvement of Shared Field configuration when no suitable Shared field available of a type
  • CTSK-4269762 - Option to include the contents of archives in exported documents
  • CTSK-4269770 - Modify the doc export to have the attachments in an inner ZIP within the document export archive
  • CTSK-4270031 - Improve the existing Expand attachments option to embed files in the Word export itself
  • CTSK-4270037 - Add a new property to the columns of the Test Step Results table of Test Runs for supporting custom test step fields
  • CTSK-4295041 - Doc export - Finalize backend
  • CTSK-4305836 - Closed status for test management workflow
  • CTSK-4330058 - Check available of API Callback URL
  • CTSK-4332959 - PhantomJS should work with invalid or self-signed certificate
  • CTSK-4358644 - Test Step reuse and custom Test Step columns
  • CTSK-4373121 - Propagate historical filtering through query nodes to allow versioned references in the traceability result
  • CTSK-4373144 - Fetch proper version for each individual item, as they may be referenced explicitly
  • CTSK-4375405 - Custom test steps fields in table view
  • CTSK-4380382 - Change Traceability Swagger Endpoint
  • CTSK-4383169 - Document view does not show the warning message about the missing "Additional Columns" from Test Steps when generating the Test Runs
  • CTSK-4385828 - Add possibility to regenerate history search entries
  • CTSK-4386007 - Swagger - Set lock for tracker items
  • CTSK-4386014 - UI for filling test step fields when running a test
  • CTSK-4386017 - Finalize custom test steps at test cases
  • CTSK-4386020 - Test Management - Run-in excel custom test step at the template export
  • CTSK-4392464 - Add possibility to skip upgrade statements
  • CTSK-4396976 - Update the existing project templates with test management changes
  • CTSK-4412347 - Test Step reuse and custom Test Step columns: UI changes needed
  • CTSK-4425800 - Test Step reuse and custom Test Step columns in Swagger and Rest API
  • CTSK-4426148 - Implement batch processing of run-in excel import
  • CTSK-4439375 - Implement loader calling logic based on template configuration
  • CTSK-4439434 - Support accessing choice and member fields of configuration tracker items
  • CTSK-4450691 - Test Step duplicate handling and custom Test Step columns
  • CTSK-4472561 - Test Step reuse with custom columns: problem when the reused Test Case is from a different tracker with different custom-columns
  • CTSK-4506145 - Change the color of the of the test run statuses
  • CTSK-4512248 - Change Word export implementation not to rely on historical filtering (when not needed)
  • CTSK-4521182 - Disable the diagram editor (mxGraph) from test case wiki texts